Benzene, 1-methyl-4-(phenylsulfonyl)-

Phase change data

Data compiled by: Thermodynamics Research Center, NIST Boulder Laboratories, Chris Muzny director

Quantity Value Units Method Reference Comment
Tfus395.KN/AGraybill, 1967Uncertainty assigned by TRC = 2. K
Tfus400.4KN/ABeringer, Brierley, et al., 1953Uncertainty assigned by TRC = 1.5 K

In addition to the Thermodynamics Research Center (TRC) data available from this site, much more physical and chemical property data is available from the following TRC products:

References

Graybill, 1967
Graybill, B.M., The Syntheses of Aryl Sulfones, J. Org. Chem., 1967, 32, 2931-3. [all data]

Beringer, Brierley, et al., 1953
Beringer, F.M.; Brierley, A.; Drexler, M.; Gindler, E.M.; Lumpkin, C.C., Diaryliodonium Salts II. The Phenylation of Organic and Inorganic Bases, J. Am. Chem. Soc., 1953, 75, 2708. [all data]