SbBr3+

Vibrational and/or electronic energy levels

Data compiled by: Marilyn E. Jacox

State:   E

 Energy
 (cm-1
 Med.   Transition   λmin
 (nm)
 λmax
 (nm)

References

Tx = 24120 ± 320 gas Lee and Rabalais, 1974
Nicholson and Rademacher, 1974

State:   D

 Energy
 (cm-1
 Med.   Transition   λmin
 (nm)
 λmax
 (nm)

Tx = 17670 ± 320 gas Lee and Rabalais, 1974
Nicholson and Rademacher, 1974

State:   C

 Energy
 (cm-1
 Med.   Transition   λmin
 (nm)
 λmax
 (nm)

Tx = 10090 ± 320 gas Lee and Rabalais, 1974
Nicholson and Rademacher, 1974

State:   B

 Energy
 (cm-1
 Med.   Transition   λmin
 (nm)
 λmax
 (nm)

Tx = 5890 ± 320 gas Lee and Rabalais, 1974
Nicholson and Rademacher, 1974

State:   A

 Energy
 (cm-1
 Med.   Transition   λmin
 (nm)
 λmax
 (nm)

Tx = 2740 ± 320 gas Lee and Rabalais, 1974
Nicholson and Rademacher, 1974

Additional references: Jacox, 1994, page 222

Lee and Rabalais, 1974
Lee, T.H.; Rabalais, J.W., Model for spin- orbit interactions with inclusion of d electrons: Applications to photoelectron spectroscopy, J. Chem. Phys., 1974, 60, 1172. [all data]

Nicholson and Rademacher, 1974
Nicholson, D.G.; Rademacher, P., Photoelectron spectra and electronic structures of antimony(III) halides, Acta Chem. Scand. Ser. A:, 1974, 28, 1136. [all data]

Jacox, 1994
Jacox, M.E., Vibrational and electronic energy levels of polyatomic transient molecules, American Chemical Society, Washington, DC, 1994, 464. [all data]