Cyclohexanemethanol, 4-ethenyl-α,α,4-trimethyl-3-(1-methylethenyl)-, [1R-(1α,3α,4β)]-

Kovats' RI, non-polar column, isothermal

View large format table.

Column type Active phase Temperature (C) I Reference Comment
CapillaryDB-1150.1540.Viswanathan, Maridass, et al., 200228. m/0.25 mm/0.25 μm, He

Kovats' RI, non-polar column, temperature ramp

View large format table.

Column type Active phase I Reference Comment
CapillaryDB-51549.Adams, González Elizondo, et al., 200630. m/0.26 mm/0.25 μm, He, 3. K/min; Tstart: 60. C; Tend: 246. C
CapillaryDB-51551.Lucero, Fredrickson, et al., 200630. m/0.25 mm/0.25 μm, He, 3. K/min; Tstart: 60. C
CapillaryBP-11538.Raina, Verma, et al., 200625. m/0.32 mm/0.25 μm, N2, 5. K/min, 220. C @ 13. min; Tstart: 60. C
CapillaryDB-51549.Adams and Nguyen, 200530. m/0.26 mm/0.25 μm, He, 3. K/min; Tstart: 60. C; Tend: 246. C
CapillaryDB-51550.Viña and Murillo, 200330. m/0.25 mm/0.25 μm, He, 50. C @ 5. min, 0.5 K/min, 250. C @ 10. min
CapillaryDB-51562.El-Ghorab, Fadel, et al., 200225. m/0.22 mm/0.25 μm, He, 3. K/min; Tstart: 60. C; Tend: 240. C
CapillaryDB-11552.Mevy, Bessiere, et al., 2002He, 3. K/min; Column length: 25. m; Column diameter: 0.2 mm; Tstart: 60. C; Tend: 220. C
CapillaryBP-11535.Raina, Lal, et al., 200260. m/0.32 mm/0.25 μm, N2, 5. K/min; Tstart: 60. C; Tend: 220. C
CapillaryBP-11540.Raina, Srivastava, et al., 200225. m/0.32 mm/0.25 μm, N2, 5. K/min, 220. C @ 15. min; Tstart: 60. C
CapillarySE-541549.Adams, 200030. m/0.26 mm/0.25 μm, He, 3. K/min; Tstart: 60. C; Tend: 246. C
CapillaryDB-51549.Adams, 2000, 230. m/0.26 mm/0.25 μm, He, 3. K/min; Tstart: 60. C; Tend: 240. C
CapillarySE-541549.Adams, 2000, 330. m/0.26 mm/0.25 μm, 3. K/min; Tstart: 60. C; Tend: 246. C
CapillaryDB-51549.Adams, 2000, 430. m/0.26 mm/0.25 μm, He, 3. K/min; Tstart: 60. C; Tend: 246. C
CapillaryPTE-51549.Mitic and Dordevic, 200060. m/0.32 mm/0.3 μm, H2, 4.3 K/min; Tstart: 60. C; Tend: 285. C
CapillaryDB-51556.Rao, Rout, et al., 2000He, 2. K/min; Column length: 30. m; Column diameter: 0.25 mm; Tstart: 60. C; Tend: 180. C
CapillaryDB-51549.Adams, 199930. m/0.26 mm/0.25 μm, He, 3. K/min; Tstart: 60. C; Tend: 246. C
CapillaryMethyl Silicone1540.Mallavarapu, Rao, et al., 1998N2, 5. K/min; Column length: 25. m; Column diameter: 0.5 mm; Tstart: 60. C; Tend: 220. C
CapillaryDB-51529.Senatore, Urrunaga Soria, et al., 199830. m/0.25 mm/0.25 μm, He, 40. C @ 5. min, 2. K/min, 250. C @ 20. min
CapillaryDB-11548.Fiorini, Fourasté, et al., 1997He, 3. K/min; Column length: 30. m; Column diameter: 0.23 mm; Tstart: 50. C; Tend: 200. C
CapillarySE-301542.Jantan, Ahmad, et al., 1996N2, 60. C @ 10. min, 3. K/min, 180. C @ 1. min; Column length: 25. m; Column diameter: 0.2 mm
CapillarySE-301527.Jantan, Ali, et al., 1995N2, 60. C @ 10. min, 3. K/min, 180. C @ 1. min; Column length: 25. m; Column diameter: 0.2 mm
CapillaryDB-51549.Loayza, Abujder, et al., 199540. C @ 2. min, 2. K/min, 210. C @ 120. min; Column length: 30. m
CapillaryHP-11528.Raharivelomanana, Cambon, et al., 19936. K/min, 240. C @ 10. min; Column length: 15. m; Column diameter: 0.32 mm; Tstart: 40. C
CapillaryBP-11545.Ekundayo, Laakso, et al., 1988H2, 65. C @ 2. min, 5. K/min; Column length: 50. m; Column diameter: 0.33 mm; Tend: 220. C

Kovats' RI, non-polar column, custom temperature program

View large format table.

Column type Active phase I Reference Comment
CapillaryHP-51550.de Marchese, de Heluani, et al., 2007He; Program: 60C(5min) => 3C/min => 100C => 1C/min => 160C => 10C/min => 240C(10min)
CapillaryHP-5MS1537.Mevy, Bousquet-Melou, et al., 200630. m/0.25 mm/0.25 μm, He; Program: 50C(2min) => 2C/min => 160C(5min) => 50C/min => 270C (6min)
CapillaryHP-51548.Frizzo, Serafini, et al., 200130. m/0.32 mm/0.25 μm, H2; Program: 60 0C (8 min) 3 K/min -> 180 0C 20 K/min (20 min)
CapillaryDB-51550.Rao, Rout, et al., 2000He; Column length: 30. m; Column diameter: 0.25 mm; Program: not specified
CapillaryDB-51549.Adams, 199830. m/0.26 mm/0.25 μm; Program: not specified

Kovats' RI, polar column, temperature ramp

View large format table.

Column type Active phase I Reference Comment
CapillaryCarbowax 20M2102.Mallavarapu, Rao, et al., 1998N2, 5. K/min; Column length: 25. m; Column diameter: 0.5 mm; Tstart: 60. C; Tend: 200. C
CapillarySupelcowax-102049.Loayza, Abujder, et al., 199540. C @ 2. min, 2. K/min, 210. C @ 120. min; Column length: 30. m
CapillarySupelcowax-102049.Loayza, Abujder, et al., 199540. C @ 2. min, 2. K/min, 210. C @ 120. min; Column length: 30. m
CapillaryDB-Wax2079.Umano, Hagi, et al., 1994He, 40. C @ 2. min, 2. K/min; Column length: 60. m; Column diameter: 0.25 mm; Tend: 200. C

Kovats' RI, polar column, custom temperature program

View large format table.

Column type Active phase I Reference Comment
CapillaryHP-Innowax2074.Frizzo, Serafini, et al., 200130. m/0.32 mm/0.50 μm, H2; Program: 60 0C (8 min) 3 K/min -> 180 0C 20 K/min -> 230 0C (20 min)
CapillaryCarbowax2105.Okamoto, Ellison, et al., 1981Column length: 127. m; Column diameter: 0.75 mm; Program: not specified

Van Den Dool and Kratz RI, non-polar column, temperature ramp

View large format table.

Column type Active phase I Reference Comment
CapillaryBP-11535.Boti, Koukoua, et al., 200750. m/0.22 mm/0.25 μm, He, 2. K/min, 220. C @ 20. min; Tstart: 60. C
CapillaryCP-Sil PONA GB1559.Cunicao, Lopes, et al., 2007100. m/0.25 mm/0.25 μm, He, 140. C @ 10. min, 5. K/min, 230. C @ 25. min
CapillaryDB-51549.Maccioni, Baldini, et al., 200730. m/0.25 mm/0.25 μm, He, 3. K/min; Tstart: 60. C; Tend: 240. C
CapillaryDB-51546.Yu, Liao, et al., 200730. m/0.25 mm/0.25 μm, He, 3. K/min, 250. C @ 10. min; Tstart: 50. C
CapillaryCP Sil 5 CB1551.Andrianoelisoa H.S., Menut C., et al., 200630. m/0.25 mm/0.25 μm, N2, 5. K/min; Tstart: 50. C; Tend: 200. C
CapillaryBP-11539.Duquesnoy, Dinh, et al., 200650. m/0.22 mm/0.25 μm, He, 2. K/min, 220. C @ 20. min; Tstart: 60. C
CapillarySPB-11526.Salgueiro L.R., Pinto E., et al., 200630. m/0.2 mm/0.2 μm, He, 3. K/min, 220. C @ 15. min; Tstart: 70. C
CapillaryHP-5MS1542.Saroglou, Dorizas, et al., 200630. m/0.25 mm/0.25 μm, He, 60. C @ 5. min, 4. K/min; Tend: 280. C
CapillaryHP-5MS1547.Silva-Brandão, Solferini, et al., 200630. m/0.25 mm/0.25 μm, He, 3. K/min; Tstart: 60. C; Tend: 300. C
CapillaryDB-51550.Su, Ho, et al., 200630. m/0.25 mm/0.25 μm, He, 50. C @ 2. min, 5. K/min; Tend: 250. C
CapillaryBP-11533.Boti J.B., Koukoua G., et al., 200550. m/0.22 mm/0.25 μm, He, 2. K/min, 220. C @ 20. min; Tstart: 60. C
CapillarySE-541550.Brantner, Pfeifhofer, et al., 200550. m/0.25 mm/0.27 μm, H2, 5. K/min; Tstart: 50. C; Tend: 300. C
CapillaryDB-51547.Choi, 200560. m/0.25 mm/0.25 μm, N2, 70. C @ 2. min, 2. K/min, 230. C @ 20. min
CapillaryDB-11549.Dob, Berramdane, et al., 200530. m/0.32 mm/0.25 μm, N2, 50. C @ 3. min, 2. K/min, 260. C @ 5. min
CapillaryDB-11558.Dob T., Berramdane T., et al., 200530. m/0.32 mm/0.25 μm, N2, 50. C @ 3. min, 2. K/min, 260. C @ 5. min
CapillaryDB-11541.Dob, Dahmane, et al., 200530. m/0.32 mm/0.25 μm, 50. C @ 8. min, 2. K/min; Tend: 250. C
CapillaryMDN-51545.Dugo, Mondello, et al., 200530. m/0.25 mm/0.25 μm, He, 3. K/min; Tstart: 50. C; Tend: 250. C
CapillaryDB-11520.Fanciullino, Gancel, et al., 200530. m/0.25 mm/0.25 μm, He, 3. K/min, 250. C @ 20. min; Tstart: 40. C
CapillaryDB-11552.bin Jantan, Yalvema, et al., 200525. m/0.25 mm/0.25 μm, 60. C @ 10. min, 3. K/min, 180. C @ 10. min
CapillaryDB-51552.bin Jantan, Yalvema, et al., 2005, 225. m/0.25 mm/0.25 μm, N2, 75. C @ 10. min, 3. K/min, 210. C @ 1. min
CapillaryRTX-11531.Paolini, Costa, et al., 200560. m/0.22 mm/0.25 μm, He, 2. K/min, 230. C @ 35. min; Tstart: 60. C
CapillaryDB-51548.Adams, Habte, et al., 200430. m/0.26 mm/0.25 μm, He, 3. K/min; Tstart: 60. C; Tend: 246. C
CapillarySPB-11526.Antunes, Sevinate-Pinto, et al., 200430. m/0.25 mm/0.25 μm, He, 3. K/min, 220. C @ 15. min; Tstart: 70. C
CapillarySPB-11525.Cavaleiro, Salgueiro, et al., 200430. m/0.2 mm/0.2 μm, He, 3. K/min, 220. C @ 15. min; Tstart: 70. C
CapillaryHP-11513.Fernández-Ocaña, Gómez-Rodríguez, et al., 200425. m/0.32 mm/0.17 μm, He, 3. K/min; Tstart: 50. C; Tend: 200. C
CapillaryHP-5MS1547.Karioti, Hadjipavlou-Litina, et al., 200430. m/0.25 mm/0.25 μm, He, 60. C @ 5. min, 4. K/min; Tend: 280. C
CapillarySPB-11526.Moldão-Martins, Beirão-da-Costa, et al., 200430. m/0.2 mm/0.2 μm, He, 3. K/min, 220. C @ 15. min; Tstart: 70. C
CapillarySPB-11526.Moldão-Martins, Beirão-da-Costa, et al., 200430. m/0.2 mm/0.2 μm, He, 3. K/min, 220. C @ 15. min; Tstart: 70. C
CapillaryDB-5MS1549.Yu, Kim, et al., 200430. m/0.25 mm/0.25 μm, He, 40. C @ 5. min, 4. K/min, 200. C @ 20. min
CapillaryDB-51549.bin Ahmad and bin Jantan, 200325. m/0.25 mm/0.25 μm, N2, 75. C @ 10. min, 3. K/min, 210. C @ 1. min
CapillarySPB-11526.Cavaleiro, Salgueiro, et al., 200330. m/0.2 mm/0.2 μm, He, 3. K/min, 220. C @ 15. min; Tstart: 70. C
CapillaryRTX-11534.Cavalli, Tomi, et al., 200360. m/0.22 mm/0.25 μm, He, 2. K/min, 230. C @ 45. min; Tstart: 60. C
CapillaryDB-51547.Choi, 200330. m/0.25 mm/0.25 μm, N2, 70. C @ 2. min, 2. K/min, 230. C @ 20. min
CapillaryDB-11519.Gancel, Ollitrault, et al., 200330. m/0.25 mm/0.25 μm, He, 3. K/min, 250. C @ 20. min; Tstart: 40. C
CapillaryDB-51548.bin Jantan, Yassin, et al., 200330. m/0.25 mm/0.25 μm, N2, 75. C @ 10. min, 3. K/min; Tend: 230. C
CapillaryHP-51550.Skaltsa, Demetzos, et al., 200330. m/0.25 mm/0.25 μm, He, 60. C @ 5. min, 4. K/min; Tend: 280. C
CapillaryHP-51550.Tsiri, Kretsi, et al., 200330. m/0.25 mm/0.25 μm, He, 3. K/min; Tstart: 60. C; Tend: 280. C
CapillarySPB-11528.Cavaleiro, Salgueiro, et al., 200230. m/0.20 mm/0.20 μm, He, 3. K/min, 220. C @ 15. min; Tstart: 70. C
CapillaryHP-5MS1549.Demetzos, Angelopoulou, et al., 200230. m/0.25 mm/0.25 μm, 50. C @ 5. min, 3. K/min; Tend: 280. C
CapillaryDB-11540.bin Jantan and bin Ahmad, 2002N2, 60. C @ 10. min, 3. K/min, 180. C @ 10. min; Column length: 25. m; Column diameter: 0.25 mm
CapillaryRTX-51546.Mondello, Zappia, et al., 200230. m/0.25 mm/0.25 μm, He, 45. C @ 6. min, 3. K/min, 300. C @ 10. min
CapillaryHP-11530.Nath, Sarma, et al., 200224. m/0.32 mm/0.17 μm, He, 60. C @ 2. min, 4. K/min, 250. C @ 20. min
CapillaryCP Sil 5 CB1529.Pino, Marbot, et al., 200225. m/0.25 mm/0.25 μm, N2, 60. C @ 6. min, 4. K/min; Tend: 280. C
CapillaryCP Sil 5 CB1532.Pino, Marbot, et al., 2002, 230. m/0.25 mm/0.25 μm, H2, 60. C @ 10. min, 2. K/min, 280. C @ 40. min
CapillaryDB-51551.Nogueira, Bittrich, et al., 200130. m/0.25 mm/0.25 μm, H2, 3. K/min; Tstart: 60. C; Tend: 240. C
CapillaryBP-11533.Rezzi, Cavaleiro, et al., 200150. m/0.22 mm/0.25 μm, 2. K/min, 220. C @ 20. min; Tstart: 60. C
CapillaryHP-5MS1550.Skaltsa, Mavrommati, et al., 200130. m/0.25 mm/0.25 μm, He, 60. C @ 5. min, 4. K/min; Tend: 280. C
CapillaryDB-51544.Bartley and Jacobs, 200060. m/0.25 mm/0.25 μm, He, 40. C @ 2. min, 4. K/min, 290. C @ 5. min
CapillaryDB-51550.Maia, de Paula, et al., 200030. m/0.25 mm/0.25 μm, He, 60. C @ 2. min, 3. K/min; Tend: 240. C
CapillaryHP-51549.Song, Sawamura, et al., 200030. m/0.25 mm/0.25 μm, He, 2. K/min; Tstart: 70. C; Tend: 230. C
CapillaryDB-51549.Song, Sawamura, et al., 2000, 230. m/0.25 mm/0.25 μm, N2, 2. K/min; Tstart: 70. C; Tend: 230. C
CapillaryMega 5MS1536.Verzera, Trozzi, et al., 200030. m/0.25 mm/0.25 μm, He, 40. C @ 2. min, 3. K/min; Tend: 240. C
CapillaryDB-11523.Muselli, Hoi, et al., 199930. m/0.25 mm/0.25 μm, 50. C @ 3. min, 3. K/min; Tend: 220. C
CapillaryHP-11524.Stashenko, Cervantes, et al., 199960. m/0.25 mm/0.25 μm, He, 50. C @ 5. min, 2.5 K/min; Tend: 250. C
CapillaryMethyl Silicone1543.Sumathykutty, Rao, et al., 199950. m/0.25 mm/0.17 μm, N2, 2. K/min; Tstart: 80. C; Tend: 200. C
CapillaryDB-51550.Nogueira, Marsaioli, et al., 199830. m/0.25 mm/0.25 μm, H2, 3. K/min; Tstart: 60. C; Tend: 240. C
CapillaryOV-11518.Bicchi, Fresia, et al., 199725. m/0.25 mm/0.3 μm, H2, 50. C @ 1. min, 3. K/min, 200. C @ 20. min
CapillaryDB-11535.Stashenko, Prada, et al., 199660. m/0.25 mm/0.25 μm, He, 50. C @ 5. min, 3.5 K/min; Tend: 250. C
CapillaryDB-11533.Stashenko, Villa, et al., 199560. m/0.25 mm/0.25 μm, H2, 50. C @ 5. min, 2.5 K/min; Tend: 250. C
CapillaryDB-11543.Bartley and Foley, 199460. m/0.32 mm/0.5 μm, 40. C @ 2. min, 4. K/min, 290. C @ 5. min
CapillaryOV-1011540.Yang, Sugisawa, et al., 1992N2, 2. K/min; Column length: 50. m; Column diameter: 0.25 mm; Tstart: 80. C; Tend: 200. C
CapillaryOV-1011543.Yang, Sugisawa, et al., 1992N2, 2. K/min; Column length: 50. m; Column diameter: 0.25 mm; Tstart: 80. C; Tend: 200. C

Van Den Dool and Kratz RI, non-polar column, custom temperature program

View large format table.

Column type Active phase I Reference Comment
CapillaryHP-5MS1557.1Andriamaharavo, 201430. m/0.25 mm/0.25 μm, He; Program: 60C (1 min) => 5 C/min => 210C => 10 C/min => 280C (15 min)
CapillaryBPX-51570.Cardeal, da Silva, et al., 200630. m/0.25 mm/0.25 μm; Program: 35C(5min) => 3C/min => 210C => 40C/min => 240C (4min)
CapillaryDB-51542.Moon, Cliff, et al., 200630. m/0.32 mm/0.25 μm, He; Program: 40C(3min) => 3C/min => 180C => 10C/min => 260C(2min)
CapillaryDB-11513.Suliman F.E.O., Fatope M.O., et al., 200630. m/0.25 mm/0.25 μm, He; Program: 35C => 2C/min => 200C => 5C/min => 240C
CapillaryBP-11536.Filippini, Tomi, et al., 2000Program: not specified
CapillarySE-521549.Lorenzo, Dellacassa, et al., 200025. m/0.25 mm/0.25 μm, He; Program: 60C(8min) => 3C/min => 180C => 20C/min => 230C

Van Den Dool and Kratz RI, polar column, temperature ramp

View large format table.

Column type Active phase I Reference Comment
CapillaryBP-202080.Boti, Koukoua, et al., 200750. m/0.22 mm/0.25 μm, He, 2. K/min, 220. C @ 20. min; Tstart: 60. C
CapillaryBP-202080.Duquesnoy, Dinh, et al., 200650. m/0.22 mm/0.25 μm, He, 2. K/min, 220. C @ 20. min; Tstart: 60. C
CapillarySupelcowax-102070.Salgueiro L.R., Pinto E., et al., 200630. m/0.2 mm/0.2 μm, He, 3. K/min, 220. C @ 15. min; Tstart: 70. C
CapillaryBP-202079.Boti J.B., Koukoua G., et al., 200550. m/0.22 mm/0.25 μm, He, 2. K/min, 220. C @ 20. min; Tstart: 60. C
CapillaryDB-Wax2090.Choi, 200560. m/0.25 mm/0.25 μm, N2, 70. C @ 2. min, 2. K/min, 230. C @ 20. min
CapillaryDB-Wax2058.Fanciullino, Gancel, et al., 200530. m/0.25 mm/0.25 μm, He, 3. K/min, 250. C @ 20. min; Tstart: 40. C
CapillaryDB-Wax2086.Njoroge, Koaze, et al., 200560. m/0.25 mm/0.25 μm, N2, 70. C @ 2. min, 2. K/min, 230. C @ 20. min
CapillaryRTX-Wax2052.Paolini, Costa, et al., 200560. m/0.22 mm/0.25 μm, He, 2. K/min, 230. C @ 35. min; Tstart: 60. C
CapillarySupelcowax-102073.Cavaleiro, Salgueiro, et al., 200430. m/0.2 mm/0.2 μm, He, 3. K/min, 220. C @ 15. min; Tstart: 70. C
CapillaryDB-Wax2063.Yu, Kim, et al., 200430. m/0.25 mm/0.25 μm, He, 40. C @ 5. min, 4. K/min, 200. C @ 20. min
CapillaryRTX-Wax2077.Cavalli, Tomi, et al., 200360. m/0.22 mm/0.25 μm, He, 2. K/min, 230. C @ 45. min; Tstart: 60. C
CapillaryDB-Wax2089.Choi, 200360. m/0.25 mm/0.25 μm, N2, 70. C @ 2. min, 2. K/min, 230. C @ 20. min
CapillaryDB-Wax2058.Gancel, Ollitrault, et al., 200360. m/0.32 mm/0.25 μm, H2, 1.5 K/min, 245. C @ 20. min; Tstart: 40. C
CapillaryRTX-Wax2056.Mondello, Zappia, et al., 200230. m/0.25 mm/0.25 μm, He, 45. C @ 6. min, 3. K/min, 250. C @ 10. min
CapillaryDB-Wax2101.Bartley and Jacobs, 200060. m/0.5 mm/0.32 μm, He, 40. C @ 2. min, 4. K/min, 290. C @ 5. min
CapillaryDB-Wax2110.Brophy, Goldsack, et al., 200060. m/0.53 mm/1.0 μm, He, 3. K/min; Tstart: 50. C; Tend: 220. C
CapillaryDB-Wax2110.Brophy, Goldsack, et al., 2000, 260. m/0.53 mm/1.0 μm, He, 3. K/min; Tstart: 50. C; Tend: 220. C
CapillaryCP-Wax 52CB2086.Chagonda, Makanda, et al., 200025. m/0.25 mm/0.15 μm, 40. C @ 5. min, 3. K/min; Tend: 220. C
CapillaryDB-Wax2090.Choi and Sawamura, 200060. m/0.25 mm/0.25 μm, N2, 70. C @ 2. min, 2. K/min, 230. C @ 20. min
CapillaryMegawax2043.Verzera, Trozzi, et al., 200030. m/0.25 mm/0.25 μm, He, 40. C @ 6. min, 2. K/min, 220. C @ 10. min
CapillaryDB-Wax2110.Brophy, Goldsack, et al., 1999He, 3. K/min; Column length: 60. m; Column diameter: 0.53 mm; Tstart: 50. C; Tend: 220. C
CapillaryInnowax2076.Stashenko, Cervantes, et al., 199960. m/0.25 mm/0.25 μm, He, 50. C @ 5. min, 2.5 K/min; Tend: 180. C
CapillaryCarbowax 20M2083.Bicchi, Fresia, et al., 199725. m/0.25 mm/0.3 μm, 50. C @ 1. min, 3. K/min, 200. C @ 20. min
CapillaryCP-Wax 52CB2098.Chyau, Mau, et al., 199650. m/0.23 mm/0.12 μm, H2, 50. C @ 10. min, 1.5 K/min, 200. C @ 10. min
CapillaryDB-Wax2076.Stashenko, Prada, et al., 199660. m/0.25 mm/0.25 μm, He, 50. C @ 5. min, 2.5 K/min; Tend: 180. C
CapillaryCarbowax 20M2076.Chen and Ho, 1988He, 1.5 K/min, 225. C @ 80. min; Column length: 60. m; Column diameter: 0.32 mm; Tstart: 50. C

Van Den Dool and Kratz RI, polar column, custom temperature program

View large format table.

Column type Active phase I Reference Comment
CapillaryCarbowax 20M2046.Lorenzo, Paz, et al., 200525. m/0.32 mm/0.25 μm, H2; Program: 40C(8min) => 3C/min => 180C => 20C/min => 230C(10min)
CapillaryBP-202069.Filippini, Tomi, et al., 2000Program: not specified
CapillaryCarbowax 20M2052.Lorenzo, Dellacassa, et al., 2000Program: not specified
CapillaryHP-Innowax2080.Bisio, Ciarallo, et al., 199830. m/0.25 mm/0.25 μm, He; Program: 60C(8min) => 3C/min => 180C(5min) => 40C/min => 250C

Normal alkane RI, non-polar column, temperature ramp

View large format table.

Column type Active phase I Reference Comment
CapillaryRTX-5 MS1557.Pinheiro, de Queiros, et al., 2013Helium, 3. K/min; Column length: 30. m; Column diameter: 0.25 mm; Tstart: 60. C; Tend: 240. C
CapillaryHP-5 MS1550.Pripdeevech and Saansoomchai, 201330. m/0.25 mm/0.25 μm, Helium, 3. K/min; Tstart: 60. C; Tend: 230. C
CapillaryDB-51510.Boukhris, Bouaziz, et al., 201230. m/0.25 mm/0.25 μm, Helium, 100. C @ 1. min, 10. K/min, 260. C @ 10. min
CapillaryHP-5 MS1549.Phungpanya, Thongpoon, et al., 201230. m/0.25 mm/0.25 μm, Helium, 2. K/min; Tstart: 50. C; Tend: 180. C
CapillaryHP-5 MS1546.Zouari, Ayadi, et al., 201230. m/0.25 mm/0.25 μm, Helium, 50. C @ 1. min, 7. K/min, 250. C @ 5. min
CapillaryDB-5 MS1557.Cui, Yang, et al., 201130. m/0.25 mm/0.25 μm, Helium, 3. K/min; Tstart: 60. C; Tend: 270. C
CapillaryCP-Sil 5 CB1543.Mothana, Hasson, et al., 201130. m/0.25 mm/0.26 μm, Nitrogen, 3. K/min, 280. C @ 22. min; Tstart: 45. C
CapillaryHP-51551.Bi Kouame, Bedi, et al., 201030. m/0.25 mm/0.25 μm, Helium, 50. C @ 5. min, 50. K/min, 300. C @ 5. min
CapillaryHP-51547.Cavar, Maksimovic, et al., 201030. m/0.252 mm/0.25 μm, Helium, 3. K/min; Tstart: 60. C; Tend: 240. C
CapillaryDB-51550.Ho, Wang, et al., 201030. m/0.25 mm/0.25 μm, Helium, 2. K/min; Tstart: 50. C; Tend: 250. C
CapillaryDB-11541.Mirjalili, Salehi, et al., 201025. m/0.25 mm/0.25 μm, Nitrogen, 60. C @ 1. min, 4. K/min, 250. C @ 10. min
CapillaryHP-51552.Monsef-Esfahani, Miri, et al., 201030. m/0.25 mm/0.25 μm, Helium, 50. C @ 5. min, 3. K/min; Tend: 240. C
CapillaryHP-5 MS1551.Radulovic, Dordevic, et al., 201030. m/0.25 mm/0.25 μm, Helium, 5. K/min, 290. C @ 10. min; Tstart: 70. C
CapillaryOV-1011550.Benites, Moiteiro, et al., 200950. m/0.25 mm/0.25 μm, Helium, 2. K/min; Tstart: 70. C; Tend: 220. C
CapillaryCP-Sil 5 CB1556.Hnawia, Menut, et al., 200930. m/0.25 mm/0.25 μm, Nitrogen, 5. K/min; Tstart: 50. C; Tend: 200. C
CapillaryCP-Sil 5 CB1558.Hnawia, Menut, et al., 200930. m/0.25 mm/0.25 μm, Nitrogen, 5. K/min; Tstart: 50. C; Tend: 200. C
CapillaryDB-51550.Ho, Wang, et al., 200930. m/0.25 mm/0.25 μm, Helium, 50. C @ 2. min, 5. K/min; Tend: 250. C
CapillaryDB-5 MS1550.Koba, Sanda, et al., 200930. m/0.25 mm/0.25 μm, Helium, 50. C @ 5. min, 2. K/min; Tend: 250. C
CapillaryRTX-11536.Museli, Pau, et al., 200960. m/0.22 mm/0.25 μm, Helium, 2. K/min, 230. C @ 30. min; Tstart: 60. C
CapillaryRTX-11541.Museli, Pau, et al., 200960. m/0.22 mm/0.25 μm, Helium, 2. K/min, 230. C @ 30. min; Tstart: 60. C
CapillaryDB-51550.Scrivanti, Anton, et al., 200930. m/0.25 mm/0.25 μm, Nitrogen, 2. K/min; Tstart: 40. C; Tend: 230. C
CapillaryDB-51549.Soleimani and Azar, 200930. m/0.25 mm/0.25 μm, Nitrogen, 60. C @ 3. min, 5. K/min, 220. C @ 5. min
CapillaryHP-5 MS1549.Adams, Beauchamp, et al., 200730. m/0.25 mm/0.25 μm, Helium, 50. C @ 10. min, 3. K/min, 230. C @ 10. min
CapillaryDB-51555.Amiri, 200750. m/0.20 mm/0.32 μm, Nitrogen, 60. C @ 3. min, 5. K/min, 220. C @ 5. min
CapillaryDB-51547.Bos, Woerdenbag, et al., 200730. m/0.26 mm/0.25 μm, He, 3. K/min; Tstart: 60. C; Tend: 240. C
CapillaryHP-5 MS1550.Capetanos, Saroglou, et al., 200730. m/0.32 mm/0.25 μm, Helium, 60. C @ 5. min, 4. K/min; Tend: 280. C
CapillaryHP-51552.Cheraif, Ben Jannet, et al., 200730. m/0.25 mm/0.25 μm, N2, 50. C @ 1. min, 5. K/min, 240. C @ 4. min
CapillaryHP-5MS1565.Cho, Abd El-Aty, et al., 200730. m/0.25 mm/0.25 μm, He, 50. C @ 4. min, 5. K/min, 280. C @ 10. min
CapillaryDB-51547.Elfami, Bos, et al., 200730. m/0.26 mm/0.25 μm, Helium, 3. K/min; Tstart: 60. C; Tend: 290. C
CapillaryHP-51560.Farsam, Amanlou, et al., 200730. m/0.25 mm/0.26 μm, Helium, 60. C @ 2. min, 4. K/min, 240. C @ 20. min
CapillaryHP-1011526.Jerkovic, Mastelic, et al., 200725. m/0.2 mm/0.2 μm, He, 70. C @ 2. min, 3. K/min; Tend: 200. C
CapillaryDB-51527.Miyazawa and Tamura, 200730. m/0.25 mm/0.25 μm, He, 2. K/min; Tstart: 60. C; Tend: 240. C
CapillaryDB-51547.Sefidkon, Abbasi, et al., 200730. m/0.25 mm/0.25 μm, He, 4. K/min; Tstart: 50. C; Tend: 240. C
CapillaryDB-51549.Sylvestre, Pichette, et al., 200730. m/0.25 mm/0.25 μm, 2. K/min, 250. C @ 33. min; Tstart: 40. C
CapillaryHP-5MS1545.7Zizovic, Stamenic, et al., 200730. m/0.25 mm/0.25 μm, He, 4. K/min; Tstart: 40. C; Tend: 260. C
CapillaryHP-51526.Abdelwahed, Hayder, et al., 200630. m/0.25 mm/0.25 μm, N2, 50. C @ 3. min, 9. K/min, 280. C @ 3. min
CapillaryHP-51543.Abdelwahed, Hayder, et al., 200630. m/0.25 mm/0.25 μm, N2, 50. C @ 3. min, 9. K/min, 280. C @ 3. min
CapillaryBP-11536.Boti, Yao, et al., 200650. m/0.22 mm/0.25 μm, 2. K/min, 220. C @ 20. min; Tstart: 60. C
CapillarySPB-11526.Cavaleiro, Pinto, et al., 200630. m/0.20 mm/0.20 μm, Helium, 3. K/min, 220. C @ 15. min; Tstart: 70. C
CapillaryHP-51550.Champagnat, Figueredo, et al., 200625. m/0.25 mm/0.25 μm, He, 50. C @ 5. min, 5. K/min; Tend: 300. C
CapillaryDB-51547.Elfami, Komar, et al., 200630. m/0.26 mm/0.25 μm, Helium, 3. K/min; Tstart: 60. C; Tend: 290. C
CapillaryHP-11528.Fernandez, Pintaric, et al., 200650. m/0.2 mm/0.33 μm, He, 2. K/min, 250. C @ 60. min; Tstart: 60. C
CapillaryCP Sil 5 CB1550.Hymete, Rohloff, et al., 200630. m/0.25 mm/0.25 μm, 3. K/min, 220. C @ 3. min; Tstart: 40. C
CapillaryHP-5MS1559.Kim, Abd El-Aty, et al., 200630. m/0.25 mm/0.25 μm, He, 50. C @ 4. min, 5. K/min, 280. C @ 10. min
CapillaryHP-5MS1549.Kim, El-Aty, et al., 200630. m/0.25 mm/0.25 μm, He, 50. C @ 4. min, 5. K/min, 280. C @ 10. min
CapillaryBP-11535.Lesueur, Ban, et al., 200650. m/0.22 mm/0.25 μm, He, 2. K/min, 220. C @ 20. min; Tstart: 60. C
CapillaryCP Sil 5 CB1534.Lis and Milczarek, 200630. m/0.32 mm/0.25 μm, N2, 4. K/min; Tstart: 50. C; Tend: 300. C
CapillaryDB-51550.Ouamba, Ouabonzi, et al., 200625. m/0.25 mm/0.15 μm, N2, 50. C @ 3. min, 4. K/min; Tend: 200. C
CapillaryHP-51542.Pintore G., Chessa M., et al., 200630. m/0.25 mm/0.25 μm, He, 60. C @ 10. min, 5. K/min; Tend: 220. C
CapillaryDB-51549.Pino, Marbot, et al., 200630. m/0.25 mm/0.25 μm, Hydrogen, 70. C @ 4. min, 4. K/min; Tend: 280. C
CapillaryHP-51553.Potzernheim, Bizzo, et al., 200625. m/0.32 mm/0.25 μm, H2, 3. K/min; Tstart: 60. C; Tend: 240. C
CapillaryHP-5MS1548.Sabulal, Dan, et al., 200630. m/0.32 mm/0.25 μm, He, 3. K/min; Tstart: 60. C; Tend: 243. C
CapillaryDB-11537.Sonboli, Mirjalili, et al., 200660. m/0.25 mm/0.25 μm, Helium, 5. K/min, 250. C @ 10. min; Tstart: 60. C
CapillaryDB-11540.Tohar, Mohd, et al., 200630. m/0.32 mm/0.25 μm, 60. C @ 3. min, 3. K/min, 230. C @ 10. min
CapillaryMethyl Silicone1570.Tonzibo, Coffy, et al., 200625. m/0.3 mm/0.15 μm, N2, 50. C @ 5. min, 2. K/min; Tend: 210. C
CapillaryDB-51551.Chagonda and Chalchat, 200550. m/0.3 mm/0.25 μm, 2. K/min; Tstart: 60. C; Tend: 240. C
CapillaryHP-51546.Duarte, Figueira, et al., 200525. m/0.2 mm/0.33 μm, He, 3. K/min, 240. C @ 7. min; Tstart: 60. C
CapillaryHP-5MS1549.Gauvin and Smadja, 200530. m/0.25 mm/0.25 μm, He, 60. C @ 30. min, 4. K/min; Tend: 200. C
CapillaryHP-5MS1551.Ghasemi Y., Faridi P., et al., 2005He, 50. C @ 3. min, 3. K/min, 250. C @ 10. min; Column length: 25. m; Column diameter: 0.25 mm
CapillaryDB-5MS1520.Marongiu, Piras, et al., 200530. m/0.25 mm/0.25 μm, He, 60. C @ 30. min, 3. K/min; Tend: 280. C
CapillaryDB-51553.Morteza-Semnani and Saeedi, 200530. m/0.25 mm/0.25 μm, He, 60. C @ 4. min, 4. K/min; Tend: 220. C
CapillaryDB-51533.de Oliveira, Dias, et al., 2005He, 40. C @ 1. min, 4. K/min; Column length: 30. m; Column diameter: 0.25 mm; Tend: 220. C
CapillaryHP-5MS1550.Petrakis, Roussis, et al., 20053. K/min; Column length: 30. m; Column diameter: 0.2 mm; Tstart: 60. C; Tend: 280. C
CapillaryHP-5MS1550.Sajjadi, 200530. m/0.25 mm/0.25 μm, He, 4. K/min; Tstart: 60. C; Tend: 280. C
CapillaryHP-5MS1550.Setzer, Noletto, et al., 200530. m/0.25 mm/0.25 μm, He, 60. C @ 5. min, 3. K/min; Tend: 280. C
CapillaryDB-51543.Simoes-Pires C.A., Debenedetti S., et al., 200530. m/0.25 mm/0.25 μm, He, 3. K/min; Tstart: 60. C; Tend: 300. C
CapillaryRTX-11543.Sonboli A., Fakhari A.R., et al., 200560. m/0.25 mm/0.25 μm, He, 5. K/min, 250. C @ 10. min; Tstart: 60. C
CapillaryRTX-11540.Sonboli, Salehi, et al., 200560. m/0.25 mm/0.25 μm, He, 5. K/min, 25. C @ 10. min; Tstart: 60. C
CapillaryDB-51515.Tzakou and Constantinidis, 200530. m/0.32 mm/0.25 μm, He, 3. K/min; Tstart: 60. C; Tend: 280. C
CapillaryCP Sil 5 CB1537.Agnaniet, Menut, et al., 200430. m/0.25 mm/0.25 μm, N2, 5. K/min; Tstart: 50. C; Tend: 200. C
CapillaryDB-11544.Choi, 200460. m/0.25 mm/0.25 μm, N2, 70. C @ 2. min, 2. K/min, 230. C @ 20. min
CapillaryDB-5MS1550.paz Lima, Silva, et al., 200430. m/0.25 mm/0.25 μm, He, 3. K/min; Tstart: 60. C; Tend: 240. C
CapillaryDB-5MS1513.Marongiu, Porcedda, et al., 200430. m/0.25 mm/0.25 μm, He, 3. K/min, 280. C @ 30. min; Tstart: 60. C
CapillaryHP-5MS1556.Mehrabani, Asadipour, et al., 200430. m/0.25 mm/0.25 μm, He, 4. K/min; Tstart: 60. C; Tend: 275. C
CapillaryDB-51542.Miyazawa, Fuhita, et al., 2004Helium, 2. K/min, 240. C @ 999. min; Column length: 30. m; Column diameter: 0.25 mm; Tstart: 60. C
CapillaryDB-51542.Miyazawa, Fujita, et al., 2004Helium, 2. K/min, 240. C @ 999. min; Column length: 50. m; Column diameter: 0.25 mm; Tstart: 60. C
CapillaryDB-11531.Nik, Mirza, et al., 200460. m/0.25 mm/0.25 μm, He, 4. K/min; Tstart: 50. C; Tend: 270. C
CapillaryDB-51550.Tirillini, Pellegrino, et al., 200430. m/0.25 mm/0.25 μm, He, 3. K/min; Tstart: 60. C; Tend: 300. C
CapillaryDB-51544.Woerdenbag, Windono, et al., 200430. m/0.249 mm/0.25 μm, He, 3. K/min; Tstart: 60. C; Tend: 300. C
CapillaryHP-5MS1546.Couladis, Özcan, et al., 200330. m/0.25 mm/0.25 μm, He, 3. K/min; Tstart: 60. C; Tend: 280. C
CapillaryDB-11518.Fekam Boyom, Ngouana, et al., 200330. m/0.25 mm/0.25 μm, N2, 5. K/min; Tstart: 50. C; Tend: 200. C
CapillaryHP-5MS1549.Ghasemi, Asghari, et al., 200330. m/0.25 mm/0.25 μm, He, 4. K/min; Tstart: 60. C; Tend: 280. C
CapillaryRSL-2001538.Jirovetz, Buchbauer, et al., 200330. m/0.32 mm/0.25 μm, H2, 40. C @ 5. min, 6. K/min, 280. C @ 5. min
CapillaryDB-51542.Marongiu, Porcedda, et al., 200330. m/0.25 mm/0.25 μm, He, 3. K/min, 280. C @ 30. min; Tstart: 60. C
CapillaryHP-51549.Mookdasanit, Tamura, et al., 2003Helium, 2. K/min, 210. C @ 60. min; Column length: 30. m; Column diameter: 0.32 mm; Tstart: 70. C
CapillaryDB-51549.Morteza-Semnani and Saeedi, 200330. m/0.25 mm/0.25 μm, He, 60. C @ 5. min, 4. K/min; Tend: 275. C
CapillaryDB-51549.Pino, Marbot, et al., 200330. m/0.25 mm/0.25 μm, H2, 60. C @ 10. min, 4. K/min, 280. C @ 40. min
CapillaryDB-51549.Pino, Marbot, et al., 200330. m/0.25 mm/0.25 μm, H2, 60. C @ 10. min, 4. K/min, 280. C @ 40. min
CapillaryHP-51546.Sajjadi and Mehregan, 200330. m/0.25 mm/0.25 μm, He, 4. K/min; Tstart: 60. C; Tend: 280. C
CapillaryDB-51552.Senatore and Bruno, 200330. m/0.25 mm/0.25 μm, 40. C @ 5. min, 2. K/min; Tend: 260. C
CapillaryHP-51547.Stashenko, Jaramillo, et al., 200360. m/0.25 mm/0.25 μm, 40. C @ 15. min, 5. K/min; Tend: 250. C
CapillaryRSL-2001541.Jirovetz, Buchbauer, et al., 200230. m/0.32 mm/0.25 μm, H2, 40. C @ 5. min, 6. K/min, 280. C @ 5. min
CapillaryRSL-2001545.Jirovetz, Ngassoum, et al., 200230. m/0.32 mm/0.25 μm, H2, 50. C @ 5. min, 6. K/min, 280. C @ 5. min
CapillaryDB-11556.Khallouki, Younos, et al., 200225. m/0.23 mm/0.20 μm, He, 50. C @ 3. min, 3. K/min, 200. C @ 30. min
CapillaryDB-51549.Kobaisy, Tellez, et al., 200230. m/0.25 mm/0.25 μm, He, 3. K/min; Tstart: 60. C; Tend: 240. C
CapillaryOV-1011540.Kuiate, Bessière, et al., 2002He, 5. K/min; Column length: 25. m; Column diameter: 0.32 mm; Tstart: 50. C; Tend: 200. C
CapillaryDB-51554.Limberger, Simões-Pires, et al., 200230. m/0.25 mm/0.25 μm, He, 3. K/min; Tstart: 60. C; Tend: 250. C
CapillaryHP-51547.Lockwood, Asghari, et al., 200230. m/0.25 mm/0.25 μm, 60. C @ 4. min, 4. K/min; Tend: 275. C
CapillaryDB-11564.Norouzi-Arasi, Yavari, et al., 200230. m/0.25 mm/0.25 μm, He, 60. C @ 10. min, 4. K/min; Tend: 250. C
CapillaryDB-11533.Sefidkon, Dabiri, et al., 2002He, 4. K/min; Column length: 60. m; Column diameter: 0.25 mm; Tstart: 40. C; Tend: 250. C
CapillaryDB-11513.Velasco-Negueruela, Pérez-Alonso, et al., 200250. m/0.25 mm/0.25 μm, N2, 3. K/min; Tstart: 60. C; Tend: 240. C
CapillaryDB-11550.Bailac, Dellacasa, et al., 200160. m/0.248 mm/0.25 μm, N2, 60. C @ 5. min, 3. K/min, 220. C @ 22. min
CapillaryRSL-2001545.Jirovetz L., Buchbauer G., et al., 200130. m/0.32 mm/0.25 μm, H2, 40. C @ 5. min, 6. K/min, 280. C @ 5. min
CapillaryDB-51549.Rousis, Papadogianni, et al., 2001He, 50. C @ 5. min, 3. K/min; Column length: 60. m; Column diameter: 0.25 mm; Tend: 250. C
CapillaryDB-11553.5Santos, Moreira, et al., 2001He, 3. K/min; Column length: 30. m; Column diameter: 0.2 mm; Tstart: 60. C; Tend: 240. C
CapillaryOV-1011543.Yang, 2001N2, 2. K/min; Column length: 50. m; Column diameter: 0.25 mm; Tstart: 80. C; Tend: 200. C
CapillaryOV-1011543.Yang, 2001, 2N2, 2. K/min; Column length: 50. m; Column diameter: 0.25 mm; Tstart: 80. C; Tend: 200. C
CapillaryDB-11538.Mallavarapu, Rao, et al., 200025. m/0.50 mm/0.25 μm, Nitrogen, 5. K/min; Tstart: 60. C; Tend: 220. C
CapillaryOV-1011543.Ayedoun, Adéoti, et al., 1999N2, 5. K/min; Column length: 25. m; Column diameter: 0.25 mm; Tstart: 50. C; Tend: 200. C
CapillaryOV-1011535.Menon, Chacko, et al., 1999N2, 1. K/min, 200. C @ 20. min; Column length: 50. m; Column diameter: 0.2 mm; Tstart: 80. C
CapillaryDB-5MS1552.Zoghbi, Andrade, et al., 199930. m/0.25 mm/0.25 μm, He, 3. K/min; Tstart: 60. C; Tend: 240. C
CapillarySPB-51555.Doneanu and Anitescu, 199850. m/0.32 mm/0.25 μm, He, 3. K/min, 240. C @ 20. min; Tstart: 60. C
CapillaryOV-11543.Kökdil, Kurucu, et al., 199850. m/0.32 mm/0.25 μm, He, 50. C @ 5. min, 10. K/min, 250. C @ 20. min
CapillaryHP-51557.Poiana, Sicari, et al., 199825. m/0.2 mm/0.33 μm, He, 70. C @ 8. min, 3. K/min, 290. C @ 20. min
CapillaryDB-51550.Santos, Andrade, et al., 199830. m/0.25 mm/0.25 μm, Helium, 3. K/min; Tstart: 60. C; Tend: 240. C
CapillaryHP-11524.Stashenko, Cervantes, et al., 199860. m/0.25 mm/0.25 μm, He, 50. C @ 5. min, 4. K/min; Tend: 280. C
CapillaryDB-51548.Tellez, Estell, et al., 199730. m/0.25 mm/0.25 μm, Helium, 3. K/min; Tstart: 60. C; Tend: 240. C
CapillaryHP-11530.Ayedoun, Adeoti, et al., 199623. m/0.32 mm/0.17 μm, He, 60. C @ 3. min, 5. K/min, 250. C @ 30. min
CapillaryOV-1011541.Chacko, Jayalekshmy, et al., 199650. m/0.25 mm/0.17 μm, N2, 5. K/min; Tstart: 50. C; Tend: 220. C
CapillaryDB-51544.8Gawdzik, Mardarowicz, et al., 199630. m/0.25 mm/0.25 μm, 60. C @ 2. min, 4. K/min, 300. C @ 5. min
CapillaryBP-11539.Rajeswara, Kaul, et al., 1996N2, 5. K/min; Column length: 25. m; Column diameter: 0.50 mm; Tstart: 60. C; Tend: 220. C
CapillaryMethyl Silicone1540.Gopalakrishnan, Menon, et al., 199350. m/0.25 mm/0.17 μm, N2, 2. K/min; Tstart: 80. C; Tend: 200. C
CapillaryMethyl Silicone1540.Gopalakrishnan, Menon, et al., 199350. m/0.25 mm/0.17 μm, N2, 3. K/min; Tstart: 80. C; Tend: 200. C
CapillaryOV-1011540.Tamura, Yang, et al., 19932. K/min; Column length: 50. m; Column diameter: 0.25 mm; Tstart: 80. C; Tend: 200. C
CapillaryOV-1011543.Tamura, Yang, et al., 19932. K/min; Column length: 50. m; Column diameter: 0.25 mm; Tstart: 80. C; Tend: 200. C
CapillaryRSL-1501535.Ronse and De Pooter, 199030. m/0.32 mm/0.20 μm, 3. K/min; Tstart: 30. C; Tend: 200. C
CapillaryOV-1011535.Sugisawa, Yamamoto, et al., 1989N2, 2. K/min; Column length: 50. m; Column diameter: 0.25 mm; Tstart: 80. C; Tend: 200. C
CapillaryOV-1011535.Sugisawa, Yang, et al., 1989N2, 2. K/min; Column length: 50. m; Column diameter: 0.25 mm; Tstart: 80. C; Tend: 200. C
CapillaryOV-1011538.Sugisawa, Yang, et al., 1989N2, 2. K/min; Column length: 50. m; Column diameter: 0.25 mm; Tstart: 80. C; Tend: 200. C

Normal alkane RI, non-polar column, custom temperature program

View large format table.

Column type Active phase I Reference Comment
CapillaryRTX-5 MS1549.Pinheiro, de Queiros, et al., 2013Helium; Column length: 30. m; Column diameter: 0.25 mm; Program: not specified
CapillaryDB-11530.Albano, Lima, et al., 201230. m/0.25 mm/0.25 μm, Hydrogen; Program: 45 0C 3 0C/min -> 175 0C 15 0C/min -> 300 0C (10 min)
CapillaryPolydimethyl siloxane with 5 % Ph groups1546.da Silva, de Souza, et al., 201230. m/0.25 mm/0.25 μm, Helium; Program: 50 0C 4 0C/min -> 200 0C (5 min) 20 0C/min -> 280 0C
Capillary5 % Phenyl polydimethyl siloxane1551.Chaverri, Diaz, et al., 2011Program: not specified
CapillaryOV-11522.Chen and Li, 2011Helium; Column length: 30. m; Column diameter: 0.25 mm; Program: 40 0C 2 0C/min -> 120 0C 10 0C/min -> 230 0C (15 min)
CapillaryCBP-51552.Fortes, Naves, et al., 201130. m/0.25 mm/0.25 μm, Helium; Program: 60 0C 3 0C/min -> 246 0C 10 0C/min -> 270 0C (5 min)
CapillaryDB-5 MS1547.Lima, Quintans-Junior, et al., 2011Helium; Column length: 30. m; Column diameter: 0.25 mm; Program: 50 0C (1.5 min) 4 0C/min -> 200 0C 10 0C/min -> 300 0C (10 min)
CapillaryHP-5 MS1547.Payo, Colo, et al., 2011Program: not specified
CapillaryHP-5 MS1548.Payo, Colo, et al., 2011Program: not specified
CapillaryHP-5 MS1549.Payo, Colo, et al., 2011Program: not specified
CapillaryHP-5 MS1541.Bamoniri, Mirjalili, et al., 201030. m/0.25 mm/0.25 μm, Helium; Program: 50 0C (2 min) 3 0C/min -> 130 0C (2 min) 5 0C/min -> 270 0C
CapillaryHP-51549.Bi Kouame, Bedi, et al., 201030. m/0.25 mm/0.25 μm, Helium; Program: not specified
CapillaryElite-5 MS1544.Kapoor, Singh, et al., 200930. m/0.25 mm/0.25 μm, Helium; Program: 60 0C (1 min) 1.5 0C/min -> 185 0C (1 min) 9 0C/min -> 275 0C (2 min)
CapillaryElite-5 MS1549.Kapoor, Singh, et al., 200930. m/0.25 mm/0.25 μm, Helium; Program: 60 0C (1 min) 1.5 0C/min -> 185 0C (1 min) 9 0C/min -> 275 0C (2 min)
CapillaryHP-51549.Riahi, Pourbasheer, et al., 2009Column length: 30. m; Column diameter: 0.32 mm; Program: not specified
CapillaryCP Sil 8 CB1549.Kristiawan, Sobolik, et al., 200830. m/0.25 mm/0.25 μm; Program: 60C => 2.5C/min => 170C => 10C/min => 250C (5min)
CapillaryRTX-51553.Zachariah, Leela, et al., 200830. m/0.25 mm/0.25 μm, Helium; Program: 60 0C (5 min) 5 0C/min -> 110 0C 3 0C/min -> 220 0C (5 min)
CapillaryRTX-51547.Zachariah, Leela, et al., 200830. m/0.25 mm/0.25 μm, Helium; Program: not specified
CapillaryHP-5MS1550.Cole, Haber, et al., 200730. m/0.25 mm/0.25 μm, He; Program: 40C(10min) => 3C/min => 200C => 2C/min => 220C
CapillaryHP-11547.Merle, Verdeguer, et al., 200730. m/0.2 mm/0.33 μm, He; Program: 60C(5min) => 3C/min => 180C => 20C/min => 280C(10min)
CapillaryDB-51550.Nivinsliene, Butkiene, et al., 200750. m/0.32 mm/0.25 μm, Helium; Program: 60 0C (1 min) 5 0C/min -> 160 0C 10 0C/min -> 250 0C
CapillaryCP Sil 8 CB1550.Radusiene, Judzentiene, et al., 200750. m/0.32 mm/0.25 μm, Helium; Program: 60 0C (2 min) 5 0C/min -> 160 0C (1 min) 10 0C/min -> 280 0C (3 min)
CapillaryHP-5 MS1549.Setzer, Stokes, et al., 2007Helium; Column length: 30. m; Column diameter: 0.25 mm; Program: 40 0C (10 min) 3 oC/min -> 200 0C 2 0C/min -> 220 0C
CapillaryHP-5 MS1550.Stokes, Cole, et al., 2007Program: not specified
CapillaryHP-5MS1549.Takaku, Haber, et al., 2007He; Column length: 30. m; Column diameter: 0.25 mm; Program: 40C(10min) => 3C/min => 200C => 2C/min => 220C
CapillaryPolydimethyl siloxane1548.Werka, Boehme, et al., 2007Program: not specified
CapillaryHP-5 MS1552.Kawaree, Phutdhawong, et al., 200630. m/0.25 mm/0.25 μm, HGelium; Program: 40 0C (3 min) 10 0C/min -> 108 0C 3 0C/min -> 188 0C 4 0C/min -> 280 0C (5 min)
CapillaryDB-51542.Massardo, Senatore, et al., 200630. m/0.25 mm/0.25 μm, He; Program: 40C (5min) => 2C/min => 250C(15min) => 5C/min => 270C (10min)
CapillaryHP-5 MS1551.Schmidt, Noletto, et al., 200630. m/0.25 mm/0.25 μm, Helium; Program: 40 0C (10 min) 3 0C/min -> 200 0C 2 0C/min -> 220 0C
CapillaryHP-5MS1550.Singh G., Maurya S., et al., 200630. m/0.32 mm/0.25 μm, He; Program: 60C(1min) => 1.5C => 185C => 9C/min => 275C (2min)
CapillarySE-521550.Tognolini, Barocelli, et al., 200630. m/0.32 mm/0.15 μm, He; Program: 45C => 1C/min => 100C => 5C/min => 250C (10min)
CapillaryCP Sil 8 CB1550.Butkienë, Nivinskienë, et al., 200550. m/0.32 mm/0.25 μm, He; Program: 50C(5min) => 2C/min => 90C => 15C/min => 240C(4min)
CapillaryDB-51551.5Cysne, Canuto, et al., 200530. m/0.25 mm/0.25 μm, He; Program: 35C => 4C/min => 180C => 10C/min => 250C
CapillaryDB-11530.Faleio, Miguel, et al., 200530. m/0.25 mm/0.25 μm, He; Program: 45C => 3C/min => 175C => 15C/min => 300C (10min)
CapillaryCP Sil 8 CB1549.Nivinskienë, Butkienë, et al., 200550. m/0.32 mm/0.25 μm, He; Program: 60C(1min) => 5C/min => 160C => 5C/min => 250C(3min)
CapillaryDB-51538.de Oliveira, Dias, et al., 2005He; Column length: 30. m; Column diameter: 0.25 mm; Program: not specified
CapillaryCP Sil 8 CB1550.Radudienë, Judpintienë, et al., 200550. m/0.32 mm/0.25 μm, He; Program: 60C(2min) => 5C/min => 160C(1min) => 10C/min => 250C (3min)
CapillaryHP-51550.Singh, Maurya, et al., 2005Column length: 30. m; Column diameter: 0.32 mm; Program: 65C(1min) => 1C/min => 75C (2min) => 0.5C/min => 81C(2min) => 3C/min => 180C(7min)
CapillaryDB-51549.Barros-Filho, Nunes, et al., 200430. m/0.25 mm/0.1 μm, He; Program: 35C => 4C/min => 180C => 20C/min => 280C
CapillaryCP Sil 8 CB1550.Butkienë, Nivinskienë, et al., 200450. m/0.32 mm/0.25 μm, He; Program: 50C(5min) => 2C/min => 90C => 15C/min => 240C(4min)
CapillaryMethyl Silicone1546.Couladis, Özcan, et al., 2004Program: not specified
CapillaryOV-11532.Hafez and Abdel-Salam, 200430. m/0.25 mm/0.25 μm, He; Program: 45 0C (4 min) 3 0C/min -> 75 0C 4 0C/min -> 115 0C 6 0C/min -> 312 0C
CapillaryBPX-51550.Koba, Sanda, et al., 200430. m/0.25 mm/0.25 μm, H2; Program: 50 0C (1 min) 3 0C/min -> 150 0C 5 0C/min -> 250 0C (5 min)
CapillaryDB-11530.Miguel, Simões, et al., 200430. m/0.25 mm/0.25 μm, He; Program: 45C => 3C/min => 175C => 15C/min => 300C (10min)
CapillaryHP-51550.Tepe, Donmez, et al., 200430. m/0.25 mm/0.25 μm, He; Program: 50C (3min) => 3C/min => 150C (10min) => 10C/min => 250C
CapillarySE-301533.Vinogradov, 2004Program: not specified
CapillarySE-301535.Vinogradov, 2004Program: not specified
CapillaryDB-11530.Faleiro, Miguel, et al., 200330. m/0.25 mm/0.25 μm, He; Program: 45C => 3C/min => 175C => 15C/min => 300C (10min)
CapillaryMethyl Silicone1537.Bakshu and Raju, 2002Program: not specified
CapillarySE-301543.Li, Wu, et al., 2002He; Column length: 60. m; Column diameter: 0.25 mm; Program: 50 0C (5 min) 5 0C/min -> 165 0C 4 0C/min -> 230 0C
CapillarySE-301540.Li, Wu, et al., 2002He; Column length: 60. m; Column diameter: 0.25 mm; Program: not specified
CapillaryDB-11530.Figueiredo, Miguel, et al., 200130. m/0.25 mm/0.25 μm; Program: 45 0C 3 K/min -> 175 0C 15 K/min -> 300 0C (10 min)
CapillaryDB-51544.Petrakis, Tsitsimpikou, et al., 2001Program: not specified
CapillaryOV-1011540.Yang, 2001N2; Column length: 50. m; Column diameter: 0.25 mm; Program: not specified
CapillaryDB-11530.da Silva, Figueiredo, et al., 199830. m/0.25 mm/0.25 μm, H2; Program: 45C => 3C/min => 175C => 15C => 240C(10min)
CapillaryPolydimethyl siloxanes1535.Zenkevich, 1997Program: not specified

Normal alkane RI, polar column, temperature ramp

View large format table.

Column type Active phase I Reference Comment
CapillaryRTX-Wax2060.Museli, Pau, et al., 200960. m/0.22 mm/0.25 μm, Helium, 2. K/min, 230. C @ 30. min; Tstart: 60. C
CapillaryHP Innowax2082.Capetanos, Saroglou, et al., 200730. m/0.32 mm/0.50 μm, Helium, 3. K/min; Tstart: 60. C; Tend: 260. C
CapillaryHP-Innowax2087.Cheraif, Ben Jannet, et al., 200730. m/0.25 mm/0.25 μm, N2, 50. C @ 1. min, 5. K/min, 240. C @ 4. min
CapillaryTC-Wax2043.Miyazawa and Tamura, 200760. m/0.25 mm/0.25 μm, He, 2. K/min; Tstart: 60. C; Tend: 240. C
CapillaryCarbowax2081.Singh, Kumar, et al., 200760. m/0.25 mm/0.25 μm, He, 5. K/min; Tstart: 40. C; Tend: 180. C
CapillarySupelcowax-102086.Sylvestre, Pichette, et al., 200730. m/0.25 mm/0.25 μm, 2. K/min, 250. C @ 33. min; Tstart: 40. C
CapillarySupelcowax-102066.Vichi, Riu-Aumatell, et al., 200730. m/0.25 mm/0.25 μm, He, 40. C @ 5. min, 3. K/min, 250. C @ 10. min
CapillaryInnowax2076.Abdelwahed, Hayder, et al., 200630. m/0.25 mm/0.25 μm, N2, 50. C @ 3. min, 9. K/min, 280. C @ 3. min
CapillaryInnowax2080.Abdelwahed, Hayder, et al., 200630. m/0.25 mm/0.25 μm, N2, 50. C @ 3. min, 9. K/min, 280. C @ 3. min
CapillaryBP-202081.Boti, Yao, et al., 200650. m/0.22 mm/0.25 μm, 2. K/min, 220. C @ 20. min; Tstart: 60. C
CapillarySupelcowax 102070.Cavaleiro, Pinto, et al., 200630. m/0.20 mm/0.20 μm, Helium, 3. K/min, 220. C @ 15. min; Tstart: 70. C
CapillaryCP-Wax 52CB2078.Hymete, Rohloff, et al., 200630. m/0.32 mm/0.25 μm, He, 60. C @ 7. min, 3.3 K/min, 220. C @ 3. min
CapillaryFFAP2100.Kitchlu, Bakshi, et al., 200620. m/0.25 mm/0.25 μm, He, 6. K/min; Tstart: 90. C; Tend: 250. C
CapillaryBP-202082.Lesueur, Ban, et al., 200650. m/0.22 mm/0.25 μm, He, 2. K/min, 220. C @ 20. min; Tstart: 60. C
CapillarySupelcowax2031.Gauvin and Smadja, 200560. m/0.2 mm/0.2 μm, He, 60. C @ 30. min, 4. K/min; Tend: 230. C
CapillaryCP-Wax2055.Ka, Choi, et al., 200530. m/0.32 mm/0.25 μm, He, 40. C @ 2. min, 5. K/min; Tend: 180. C
CapillaryDB-Wax2083.Lee, Umano, et al., 200530. m/0.25 mm/0.25 μm, He, 3. K/min, 180. C @ 40. min; Tstart: 50. C
CapillaryDB-Wax2103.Njoroge, Koaze, et al., 2005, 260. m/0.25 mm/0.25 μm, N2, 70. C @ 2. min, 2. K/min, 230. C @ 20. min
CapillarySupelcowax-102066.Vichi, Riu-Aumatell, et al., 200530. m/0.25 mm/0.25 μm, 40. C @ 5. min, 3. K/min, 220. C @ 10. min
CapillaryDB-Wax2087.Choi, 200460. m/0.25 mm/0.25 μm, N2, 70. C @ 2. min, 2. K/min, 230. C @ 20. min
CapillaryDB-Wax2088.Choi, 2004, 260. m/0.25 mm/0.25 μm, N2, 70. C @ 2. min, 2. K/min, 230. C @ 20. min
CapillaryDB-Wax2078.Jiang and Kubota, 2004He, 60. C @ 4. min, 2. K/min; Column length: 60. m; Column diameter: 0.25 mm; Tend: 220. C
CapillaryDB-Wax2078.Jiang and Kubota, 2004He, 60. C @ 4. min, 2. K/min; Column length: 60. m; Column diameter: 0.25 mm; Tend: 220. C
CapillaryDB-Wax2076.Mookdasanit, Tamura, et al., 2003Helium, 2. K/min, 210. C @ 60. min; Column length: 60. m; Column diameter: 0.25 mm; Tstart: 70. C
CapillaryHP-Innowax2075.Stashenko, Jaramillo, et al., 200350. m/0.2 mm/0.2 μm, 50. C @ 5. min, 4. K/min; Tend: 220. C
CapillaryDB-Wax2069.Umano, Hagi, et al., 200260. m/0.25 mm/0.25 μm, He, 40. C @ 2. min, 2. K/min; Tend: 200. C
CapillaryDB-Wax2083.Christoph, 200160. m/0.25 mm/0.25 μm, He, 3. K/min; Tstart: 45. C; Tend: 240. C
CapillaryStabilwax2076.Jirovetz L., Buchbauer G., et al., 200130. m/0.32 mm/0.25 μm, H2, 60. C @ 5. min, 10. K/min, 280. C @ 5. min
CapillaryCP-Wax 52CB2086.Chagonda, Makanda, et al., 2000, 250. m/0.30 mm/0.25 μm, He, 40. C @ 5. min, 3. K/min; Tend: 220. C
CapillaryBP-202080.Mallavarapu, Rao, et al., 200025. m/0.50 mm/0.25 μm, Nitrogen, 5. K/min; Tstart: 60. C; Tend: 200. C
CapillaryNB-3512073.Onocha, Ekundayo, et al., 199925. m/0.3 mm/0.5 μm, H2, 70. C @ 2. min, 5. K/min; Tend: 250. C
CapillaryHP-Innowax2076.Stashenko, Cervantes, et al., 199860. m/0.25 mm/0.25 μm, He, 50. C @ 5. min, 5. K/min; Tend: 220. C
CapillaryBP-202089.Bignell, Dunlop, et al., 199725. m/0.33 mm/0.5 μm, H2, 5. K/min; Tstart: 80. C; Tend: 220. C
CapillaryCP-Wax 52CB2038.3Chyau, Chen, et al., 199250. m/0.32 mm/0.22 μm, H2, 50. C @ 5. min, 2. K/min; Tend: 200. C
CapillaryDB-Wax2089.van Beek, Kleis, et al., 198960. m/0.25 mm/0.25 μm, H2, 4. K/min, 238. C @ 13. min; Tstart: 50. C

Normal alkane RI, polar column, custom temperature program

View large format table.

Column type Active phase I Reference Comment
CapillaryHP-Innowax FSC2096.Tabanca N., Demirci B., et al., 200760. m/0.25 mm/0.25 μm, He; Program: 60C(10min) => 4C/min => 220C(10min) => 1C/min => 240C
CapillaryHP Innowax FSP2096.Tabanca N., Demirci B., et al., 2007, 260. m/0.25 mm/0.25 μm, N2; Program: 60C(10min) => 4C/min => 220C(10min) => 1C/min => 240C
CapillaryHP-Innowax FSC2096.Suleimenov Y.M., Atazhanova G.A., et al., 200660. m/0.25 mm/0.25 μm, He; Program: 60(10min) => 4C/min => 220C(10min) => 1C/min => 240C
CapillaryHP-Innowax FSC2096.Tabanca, Demirci, et al., 200560. m/0.25 mm/0.25 μm, He; Program: 60C(10min) => 4C/min => 220C(10min) => 1C/min => 240C
CapillaryHP-Innowax FSC2096.Kivcak, Akay, et al., 200460. m/0.25 mm/0.25 μm, He; Program: 60C(10min) => 4C/min => 220C(10min) => 1C/min => 240C
CapillaryCarbowax 20M2069.Vinogradov, 2004Program: not specified
CapillaryCarbowax 20M2077.Vinogradov, 2004Program: not specified
CapillaryInnowax FSC2096.Baser, Demirci, et al., 200360. m/0.25 mm/0.25 μm, He; Program: 60C(10min) => 4C/min => 220C (10min) => 1C/min => 240C
CapillaryHP-Innowax FSC2096.Demirci, Baser, et al., 200360. m/0.25 mm/0.25 μm, He; Program: 60C (10min) => 4C/min => 220C (10min) => 1C/min => 240C
CapillaryInnowax FSC2096.Baser, Demirei, et al., 200260. m/0.25 mm/0.25 μm, He; Program: 60C(10min) => 4C/min => 220C(10min) => 1C/min => 240C
CapillaryHP-Innowax2096.Demirci, Baser, et al., 200260. m/0.25 mm/0.25 μm, He; Program: 60 0C (10 min) 4 K/min -> 220 0C (10 min) 1 K/min -> 240 0C
CapillaryInnowax FSC2096.Tunalier, Kirimer, et al., 200260. m/0.25 mm/0.25 μm; Program: 60C(10min) => 4C/min => 220C(10min) => 1C/min => 240C
CapillaryHP-Innowax2096.Baser, Demirci, et al., 200160. m/0.25 mm/0.25 μm, He; Program: 60 0C (10 min) 10 K/min -> 220 0C (10 min) 1K/min -> 240 0C
CapillaryHP-Innowax FSC2096.Kaya, Demirci, et al., 200160. m/0.25 mm/0.25 μm; Program: 60C(10min) => 4C/min => 220C(10min) => 1C/min => 240C
CapillaryInnowax2096.Baser, Özek, et al., 200060. m/0.25 mm/0.25 μm, He; Program: 60 0C (10 min) 4 K/min -> 220 0C (10 min) 1 K/min -> 240 0C
CapillaryInnowax FSC2096.Kirimer, Tabanca, et al., 200060. m/0.25 mm/0.25 μm, He; Program: 60C(10 min) => 4C/min => 220C(10min) => 1C/min => 240C
CapillaryInnowax2096.Baser, Kürkcüoglu, et al., 199860. m/0.25 mm/0.25 μm; Program: 60C(10min) => 4C/min => 220C(10min) => 1C/min => 240C
CapillarySupelcowax 102074.Castioni and Kapetanidis, 199660. m/0.25 mm/0.25 μm, Helium; Program: 60 0C (10 min) 2 0C/min -> 80 0C 3 0C/min -> 100 0C 4 0C/min -> 220 0C (30 min)
CapillarySupelcowax 102078.Castioni and Kapetanidis, 199660. m/0.25 mm/0.25 μm, Helium; Program: not specified
CapillarySupelcowax 102085.Castioni and Kapetanidis, 199660. m/0.25 mm/0.25 μm, Helium; Program: not specified
CapillaryNB-3512101.Kerrola and Kallio, 199425. m/0.32 mm/0.2 μm, He; Program: 35C(5min) => 2.5C/min => 150C => 5C/min => 240C (20min)

References

Viswanathan, Maridass, et al., 2002
Viswanathan, M.B.; Maridass, M.; Thangadurai, D.; Ramesh, N., Chemical constituents of the fruit essential oil of Diospyros malabarica (Desr.) Kostel (Ebenaceae), Acta Pharmaceutica, 2002, 52, 207-211. [all data]

Adams, González Elizondo, et al., 2006
Adams, R.P.; González Elizondo, M.S.; González Elizondo, M.; Slinkman, E., DNA fingerprinting and terpenoid analysis of Juniperus blancoi var. huehuentensis (Cupressaceae), a new subalpine variety from Durango, Mexico, Biochem. Syst. Ecol., 2006, 34, 3, 205-211, https://doi.org/10.1016/j.bse.2005.11.004 . [all data]

Lucero, Fredrickson, et al., 2006
Lucero, M.E.; Fredrickson, E.L.; Estell, R.E.; Morrison, A.A.; Richman, D.B., Volatile Composition of Gutierrezia sarothrae (Broom Snakeweed) as Determined by Steam Distillation and Solid Phase Microextraction, J. Essent. Oil Res., 2006, 18, 2, 121-125, https://doi.org/10.1080/10412905.2006.9699039 . [all data]

Raina, Verma, et al., 2006
Raina, V.K.; Verma, S.C.; Dhawan, S.; Khan, M.; Ramesh, S.; Singh, S.C.; Yadav, A.; Srivastava, S.K., Essential oil composition of Murraya exotica from the plains of northern India, Flavour Fragr. J., 2006, 21, 1, 140-142, https://doi.org/10.1002/ffj.1547 . [all data]

Adams and Nguyen, 2005
Adams, R.P.; Nguyen, S., Infra-specific variation in Juniperus deppeana and F. Sperryi in the Davis Mountains of Texas: variation in leaf essential oils and random amplified polymorphic DNAS (RAPDS), Phytologia, 2005, 87, 2, 96-108. [all data]

Viña and Murillo, 2003
Viña, A.; Murillo, E., Essential oil composition from twelve varieties of basil (Ocimum spp) grown in Columbia, J. Braz. Chem. Soc., 2003, 14, 5, 744-749, https://doi.org/10.1590/S0103-50532003000500008 . [all data]

El-Ghorab, Fadel, et al., 2002
El-Ghorab, A.H.; Fadel, H.M.; El-Massry, K.F., The Egyptian Eucalyptus camaldulensis var. brevirostris: chemical compositions of the fruit volatile oil and antioxidant activity, Flavour Fragr. J., 2002, 17, 4, 306-312, https://doi.org/10.1002/ffj.1085 . [all data]

Mevy, Bessiere, et al., 2002
Mevy, J.P.; Bessiere, J.-M.; Dherbomez, M.; Viano, J., Composition and some biological activities of the essential oils from an African pasture grass: Elionurus elegans Kunth., J. Agric. Food Chem., 2002, 50, 15, 4240-4243, https://doi.org/10.1021/jf0115140 . [all data]

Raina, Lal, et al., 2002
Raina, V.K.; Lal, R.K.; Tripathi, S.; Khan, M.; Syamasundar, K.V.; Srivastava, S.K., Erratum. Essential oil composition of genetically diverse stocks of Murraya koenigii from India, Flavour Fragr. J., 2002, 17, 5, 404, https://doi.org/10.1002/ffj.1139 . [all data]

Raina, Srivastava, et al., 2002
Raina, V.K.; Srivastava, S.K.; Syamasunder, K.V., The essential oil of 'greater galangal' [Alpinia galanga (L.) Willd.] from the lower Himalayan region of India, Flavour Fragr. J., 2002, 17, 5, 358-360, https://doi.org/10.1002/ffj.1105 . [all data]

Adams, 2000
Adams, R.P., Systematics of smooth leaf margin Juniperus of the western hemisphere based on leaf essential oils and RAPD DNA fingerprinting, Biochem. Syst. Ecol., 2000, 28, 2, 149-162, https://doi.org/10.1016/S0305-1978(99)00047-2 . [all data]

Adams, 2000, 2
Adams, R.P., Systematics of Juniperus section Juniperus based on leaf essential oils and random amplified polymorphic DNAs (RAPDs), Biochem. Syst. Ecol., 2000, 28, 6, 515-528, https://doi.org/10.1016/S0305-1978(99)00089-7 . [all data]

Adams, 2000, 3
Adams, R.P., Systematics of the one seeded Juniperus of the eastern hemisphere based on leaf essential oils and random amplified polymorphic DNAs (RAPDs), Biochem. Syst. Ecol., 2000, 28, 6, 529-543, https://doi.org/10.1016/S0305-1978(99)00096-4 . [all data]

Adams, 2000, 4
Adams, R.P., The serrate leaf margined Juniperus (Section Sabina) of the western hemisphere: systematics and evolution based on leaf essential oils and Random Amplified Polymorphic DNAs (RAPDs), Biochem. Syst. Ecol., 2000, 28, 10, 975-989, https://doi.org/10.1016/S0305-1978(00)00022-3 . [all data]

Mitic and Dordevic, 2000
Mitic, V.; Dordevic, S., Essential oil composition of Hyssopus Officinalis L. cultivated in Serbia, Facta Univ. Phys. Chem. Technol., 2000, 2, 2, 105-108. [all data]

Rao, Rout, et al., 2000
Rao, Y.R.; Rout, P.K.; Jena, K.S.; Sahu, S.B., Composition of essential oil of citronella (Cymbopogon winterianus jowitt) grown in coastal Orissa, Fafai J., 2000, 2, 4, 29-31. [all data]

Adams, 1999
Adams, R.P., Systematics of multi-seeded eastern hemisphere Juniperus based on leaf essential oils and RAPD DNA fingerprinting, Biochem. Syst. Ecol., 1999, 27, 7, 709-725, https://doi.org/10.1016/S0305-1978(99)00016-2 . [all data]

Mallavarapu, Rao, et al., 1998
Mallavarapu, G.R.; Rao, B.R.R.; Kaul, P.N.; Ramesh, S.; Bhattacharya, A.K., Volatile constituents of the essential oils of the seeds and the herb of palmarosa (Cymbopogon martinii (Roxb.) Wats. var. motia Burk.), Flavour Fragr. J., 1998, 13, 3, 167-169, https://doi.org/10.1002/(SICI)1099-1026(199805/06)13:3<167::AID-FFJ719>3.0.CO;2-B . [all data]

Senatore, Urrunaga Soria, et al., 1998
Senatore, F.; Urrunaga Soria, E.; Urrunaga Soria, R.; Porta, G.D.; de Feo, V., Essential oil from two peruvian Satureja species, Flavour Fragr. J., 1998, 13, 1, 1-4, https://doi.org/10.1002/(SICI)1099-1026(199801/02)13:1<1::AID-FFJ672>3.0.CO;2-4 . [all data]

Fiorini, Fourasté, et al., 1997
Fiorini, C.; Fourasté, I.; David, B.; Bessière, J.M., Composition of the flower, leaf, and stem essential oils from Laurus nobilis L., Flavour Fragr. J., 1997, 12, 2, 91-93, https://doi.org/10.1002/(SICI)1099-1026(199703)12:2<91::AID-FFJ623>3.0.CO;2-3 . [all data]

Jantan, Ahmad, et al., 1996
Jantan, I.; Ahmad, A.S.; Ahmad, A.R.; Ali, N.A.M.; Ayop, N., Chemical composition of some citrus oils from Malaysia, J. Essent. Oil Res., 1996, 8, 6, 627-632, https://doi.org/10.1080/10412905.1996.9701030 . [all data]

Jantan, Ali, et al., 1995
Jantan, I.; Ali, N.A.M.; Ahmad, A.S.; Ahmad, A.R., Constituents of the essential oil of Leptospermum javanicum blume from peninsular Malaysia, Flavour Fragr. J., 1995, 10, 4, 255-258, https://doi.org/10.1002/ffj.2730100406 . [all data]

Loayza, Abujder, et al., 1995
Loayza, I.; Abujder, D.; Aranda, R.; Jakupovic, J.; Collin, G.; Deslauriers, H.; Jean, F.-I., Essential oils of Baccharis salicifolia, B. latifolia and B. dracunculifolia, Phytochemistry, 1995, 38, 2, 381-389, https://doi.org/10.1016/0031-9422(94)00628-7 . [all data]

Raharivelomanana, Cambon, et al., 1993
Raharivelomanana, P.; Cambon, A.; Azzaro, M.; Bianchini, J.-P.; Claude-Lafontaine, A.; George, G., Volatile Constituents of Neocallitropsis pancheri (Carriere) de Laubenfels Heartwood Extracts (Cupressaceae), J. Essent. Oil Res., 1993, 5, 6, 587-595, https://doi.org/10.1080/10412905.1993.9698289 . [all data]

Ekundayo, Laakso, et al., 1988
Ekundayo, O.; Laakso, I.; Adegbola, R.-M.; Oguntimein, B.; Sofowora, A.; Hiltunen, R., Essential oil constituents of Ashanti pepper (Piper guineense) fruits (berries), J. Agric. Food Chem., 1988, 36, 5, 880-882, https://doi.org/10.1021/jf00083a001 . [all data]

de Marchese, de Heluani, et al., 2007
de Marchese, M.J.A.; de Heluani, C.S.; Catalán, C.A.N.; Griffin, C.A.; Vaughn, J.B., Jr.; Herz, W., Incisol, an alcohol with a novel sesquiterpene skeleton from Xenophyllum incisum, Biochem. Syst. Ecol., 2007, 35, 3, 169-175, https://doi.org/10.1016/j.bse.2006.10.006 . [all data]

Mevy, Bousquet-Melou, et al., 2006
Mevy, J.P.; Bousquet-Melou, A.; Greff, S.; Millogo, J.; Fernandez, C., Chemical composition of the volatile oil of Laggera aurita Schulz from Burkina-Faso, Biochem. Syst. Ecol., 2006, 34, 11, 815-818, https://doi.org/10.1016/j.bse.2006.06.005 . [all data]

Frizzo, Serafini, et al., 2001
Frizzo, C.D.; Serafini, L.A.; Dellacassa, E.; Lorenzo, D.; Moyna, P., Essential oil of Baccharis uncinella DC. from Southern Brazil, Flavour Fragr. J., 2001, 16, 4, 286-288, https://doi.org/10.1002/ffj.998 . [all data]

Adams, 1998
Adams, R.P., The essential oils and chemotaxonomy of Juniperus sect. Juniperus, Biochem. Syst. Ecol., 1998, 26, 6, 637-645, https://doi.org/10.1016/S0305-1978(98)00020-9 . [all data]

Umano, Hagi, et al., 1994
Umano, K.; Hagi, Y.; Tamura, T.; Shoji, A.; Shibamoto, T., Identification of volatile compounds isolated from round kumquat (Fortunella japonica Swingle), J. Agric. Food Chem., 1994, 42, 9, 1888-1890, https://doi.org/10.1021/jf00045a011 . [all data]

Okamoto, Ellison, et al., 1981
Okamoto, R.A.; Ellison, B.O.; Kepner, R.E., Volatile terpenes in Sequoia sempervirens foliage. Changes in composition during maturation, J. Agric. Food Chem., 1981, 29, 2, 324-326, https://doi.org/10.1021/jf00104a026 . [all data]

Boti, Koukoua, et al., 2007
Boti, J.B.; Koukoua, G.; N'Guessan, T.Y.; Casanova, J., Chemical variability of Conyza sumatrensis and Microglossa pyrifolia from Côte d'Ivoire, Flavour Fragr. J., 2007, 22, 1, 27-31, https://doi.org/10.1002/ffj.1743 . [all data]

Cunicao, Lopes, et al., 2007
Cunicao, M.M.; Lopes, A.R.; Côcco, L.C.; Yamamoto, C.I.; Plocharski, R.C.B.; Miguel, M.D.; Junior, A.G.; Auer, C.G.; Miguel, O.G., Phytochemical and antibacterial evaluation of essential oils from Ottonia Martiana Miq. (Piperaceae), J. Braz. Chem. Soc., 2007, 18, 1, 184-188, https://doi.org/10.1590/S0103-50532007000100021 . [all data]

Maccioni, Baldini, et al., 2007
Maccioni, S.; Baldini, R.; Luigi Cioni, P.; Tebano, M.; Flamini, G., In vivo volatiles emission and essential oils from different organs and pollen of Cistus albidus from Caprione (Eastern Liguria, Italy), Flavour Fragr. J., 2007, 22, 1, 61-65, https://doi.org/10.1002/ffj.1759 . [all data]

Yu, Liao, et al., 2007
Yu, J.Q.; Liao, Z.X.; Cai, X.Q.; Lei, J.C.; Zou, G.L., Composition, antimicrobial activity and cytotoxicity of essential oils from Aristolochia mollissima, Environmental Toxicology and Pharmacology, 2007, 23, 2, 162-167, https://doi.org/10.1016/j.etap.2006.08.004 . [all data]

Andrianoelisoa H.S., Menut C., et al., 2006
Andrianoelisoa H.S.; Menut C.; de Chatelperron P.C.; Saracco J.; Ramanoelina P.; Danthu P., Intraspecific chemical variability and highlighting of chemotypes of leaf essential oils from Ravensara aromatica Sonnerat a tree endemic to Madagascar, Flavour Fragr. J., 2006, 21, 5, 833-838, https://doi.org/10.1002/ffj.1735 . [all data]

Duquesnoy, Dinh, et al., 2006
Duquesnoy, E.; Dinh, N.H.; Castola, V.; Casanova, J., Composition of a Pyrolytic oil from Cupressus funebris Endl. of Vietnamese origin, Flavour Fragr. J., 2006, 21, 3, 453-457, https://doi.org/10.1002/ffj.1676 . [all data]

Salgueiro L.R., Pinto E., et al., 2006
Salgueiro L.R.; Pinto E.; Goncalves M.J.; Costa I.; Palmeira A.; Cavaleiro C.; Pina-Vaz C.; Rodrigues A.G.; Martinez-De-Oliveira J., Antifungal activity of the essential oil of Thymus capitellatus against Candida, Aspergillus and dermatophyte strains, Flavour Fragr. J., 2006, 21, 5, 749-753, https://doi.org/10.1002/ffj.1610 . [all data]

Saroglou, Dorizas, et al., 2006
Saroglou, V.; Dorizas, N.; Kypriotakis, Z.; Skaltsa, H.D., Analysis of the essential oil composition of eight Anthemis species from Greece, J. Chromatogr. A, 2006, 1104, 1-2, 313-322, https://doi.org/10.1016/j.chroma.2005.11.087 . [all data]

Silva-Brandão, Solferini, et al., 2006
Silva-Brandão, K.L.; Solferini, V.N.; Trigo, J.R., Chemical and phylogenetic relationships among Aristolochia L. (Aristolochiaceae) from southeastern Brazil, Biochem. Syst. Ecol., 2006, 34, 4, 291-302, https://doi.org/10.1016/j.bse.2005.10.011 . [all data]

Su, Ho, et al., 2006
Su, Y.C.; Ho, C.L.; Wang, E.I.C., Analysis of leaf essential oils from the indigenous five conifers of Taiwan, Flavour Fragr. J., 2006, 21, 3, 447-452, https://doi.org/10.1002/ffj.1685 . [all data]

Boti J.B., Koukoua G., et al., 2005
Boti J.B.; Koukoua G.; N'Guessan T.Y.; Muselli A.; Bernardini A.F.; Casanova J., Composition of the leaf, stem bark and root bark oils of Isolona cooperi investigated by GC (retention index), GC-MS and C-13-NMR spectroscopy, Phytochem. Anal., 2005, 16, 5, 357-363, https://doi.org/10.1002/pca.857 . [all data]

Brantner, Pfeifhofer, et al., 2005
Brantner, A.H.; Pfeifhofer, H.W.; Ercegovac, O.; Males, Z.; Plazibat, M., Essential oil composition and antioxidant activity of Thymus bracteosus Vis. ex Benth., Flavour Fragr. J., 2005, 20, 6, 596-600, https://doi.org/10.1002/ffj.1494 . [all data]

Choi, 2005
Choi, H.-S., Characteristic odor components of kumquat (Fortunella japonica Swingle) peel oil, J. Agric. Food Chem., 2005, 53, 5, 1642-1647, https://doi.org/10.1021/jf040324x . [all data]

Dob, Berramdane, et al., 2005
Dob, T.; Berramdane, T.; Chelgoum, C., Chemical composition of essential oil of Pinus halepensis Miller growing in Algeria, C.R. Chim., 2005, 8, 11-12, 1939-1945, https://doi.org/10.1016/j.crci.2005.05.007 . [all data]

Dob T., Berramdane T., et al., 2005
Dob T.; Berramdane T.; Chelghoum C., Analysis of essential oil from the needles of Pinus pinaster growing in Algeria, Chem. Nat. Compd. (Engl. Transl.), 2005, 41, 5, 545-548, https://doi.org/10.1007/s10600-005-0202-z . [all data]

Dob, Dahmane, et al., 2005
Dob, T.; Dahmane, D.; Berramdane, T.; Chelghoum, C., Chemical composition of the essential oil of Artemisia campestris L. from Algeria, Pharm. Biol., 2005, 43, 6, 512-514, https://doi.org/10.1080/13880200500220664 . [all data]

Dugo, Mondello, et al., 2005
Dugo, P.; Mondello, L.; Favoino, O.; Cicero, L.; Rodriguez Zenteno, N.A.; Dugo, G., Characterization of cold-pressed Mexican dancy tangerine oils, Flavour Fragr. J., 2005, 20, 1, 60-66, https://doi.org/10.1002/ffj.1367 . [all data]

Fanciullino, Gancel, et al., 2005
Fanciullino, A.-L.; Gancel, A.-L.; Froelicher, Y.; Luro, F.; Ollitrault, P.; Brillouet, J.-M., Effects of Nucleo-cytoplasmic Interactions on Leaf Volatile Compounds from Citrus Somatic Diploid Hybrids, J. Agric. Food Chem., 2005, 53, 11, 4517-4523, https://doi.org/10.1021/jf0502855 . [all data]

bin Jantan, Yalvema, et al., 2005
bin Jantan, I.; Yalvema, M.F.; Ahmad, N.W.; Jamal, J.A., Insecticidal activities of the leaf oils of eight Cinnamomum species against Aedes aegypti and Aedes albopictus, Pharm. Biol., 2005, 43, 6, 526-532, https://doi.org/10.1080/13880200500220771 . [all data]

bin Jantan, Yalvema, et al., 2005, 2
bin Jantan, I.; Yalvema, M.F.; Ayop, N.; Ahmad, A.S., Constituents of the essential oils of Cinnamomum sintoc Blume from a mountain forest of Peninsular Malaysia, Flavour Fragr. J., 2005, 20, 6, 601-604, https://doi.org/10.1002/ffj.1495 . [all data]

Paolini, Costa, et al., 2005
Paolini, J.; Costa, J.; Bernardini, A., Analysis of the essential oil from aerial parts of Eupatorium cannabinum subsp. corsicum (L.) by gas chromatography with electron impact and chemical ionization mass spectrometry, J. Chromatogr. A, 2005, 1076, 1-2, 170-178, https://doi.org/10.1016/j.chroma.2005.03.131 . [all data]

Adams, Habte, et al., 2004
Adams, R.P.; Habte, M.; Park, S.; Dafforn, M.R., Preliminary comparison of vetiver root essential oils from cleansed (bacteria- and fungus-free) versus non-cleansed (normal) vetiver plants, Biochem. Syst. Ecol., 2004, 32, 12, 1137-1144, https://doi.org/10.1016/j.bse.2004.03.013 . [all data]

Antunes, Sevinate-Pinto, et al., 2004
Antunes, T.; Sevinate-Pinto, I.; Barroso, J.G.; Cavaleiro, C.; Salgueiro, L.R., Micromorphology of trichomes and composition of essential oil of Teucrium capitatum, Flavour Fragr. J., 2004, 19, 4, 336-340, https://doi.org/10.1002/ffj.1310 . [all data]

Cavaleiro, Salgueiro, et al., 2004
Cavaleiro, C.; Salgueiro, L.R.; Miguel, M.G.; da Cunha, A.P., Analysis by gas chromatography?mass spectrometry of the volatile components of Teucrium lusitanicum and Teucrium algarbiensis, J. Chromatogr. A, 2004, 1033, 1, 187-190, https://doi.org/10.1016/j.chroma.2004.01.005 . [all data]

Fernández-Ocaña, Gómez-Rodríguez, et al., 2004
Fernández-Ocaña, A.M.; Gómez-Rodríguez, M.V.; Velasco-Negueruela, A.; Camacho-Simarro, A.M.; Fernández-López, C.; Altarejos, J., In vivo antifungal activity of the essential oil of Bupleurum gibraltarium against plasmopara halstedii in sunflower, J. Agric. Food Chem., 2004, 52, 21, 6414-6417, https://doi.org/10.1021/jf040219n . [all data]

Karioti, Hadjipavlou-Litina, et al., 2004
Karioti, A.; Hadjipavlou-Litina, D.; Mensah, M.L.K.; Fleischer, T.C.; Skaltsa, H., Composition and antioxidant activity of the essential oils of Xylopia aethiopica (Dun) A. Rich. (Annonaceae) leaves, stem bark, root bark, and fresh and dried fruits, growing in Ghana, J. Agric. Food Chem., 2004, 52, 26, 8094-8098, https://doi.org/10.1021/jf040150j . [all data]

Moldão-Martins, Beirão-da-Costa, et al., 2004
Moldão-Martins, M.; Beirão-da-Costa, S.; Neves, C.; Cavaleiro, C.; Salgueiro, L.; Beirão-da-Costa, M.L., Olive oil flavoured by the essential oils of Mentha × piperita and Thymus mastichina L., Food Qual. Pref., 2004, 15, 5, 447-452, https://doi.org/10.1016/j.foodqual.2003.08.001 . [all data]

Yu, Kim, et al., 2004
Yu, E.J.; Kim, T.H.; Kim, K.H.; Lee, H.J., Characterization of aroma-active compounds of Abies nephrolepis (Khingan fir) needles using aroma extract dilution analysis, Flavour Fragr. J., 2004, 19, 1, 74-79, https://doi.org/10.1002/ffj.1314 . [all data]

bin Ahmad and bin Jantan, 2003
bin Ahmad, F.; bin Jantan, I., Chemical constituents of the essential oils of Goniothalamus uvariodes King, Flavour Fragr. J., 2003, 18, 2, 128-130, https://doi.org/10.1002/ffj.1142 . [all data]

Cavaleiro, Salgueiro, et al., 2003
Cavaleiro, C.; Salgueiro, L.R.; da Cunha, A.P.; Figueiredo, A.C.; Barroso, J.G.; Bighelli, A.; Casanova, J., Composition and variability of the essential oils of the leaves and berries from Juniperus navicularis, Biochem. Syst. Ecol., 2003, 31, 2, 193-201, https://doi.org/10.1016/S0305-1978(02)00080-7 . [all data]

Cavalli, Tomi, et al., 2003
Cavalli, J.-F.; Tomi, F.; Bernardini, A.-F.; Casanova, J., Composition and chemical variability of the bark oil of Cedrelopsis grevei H. Baillon from Madagascar, Flavour Fragr. J., 2003, 18, 6, 532-538, https://doi.org/10.1002/ffj.1263 . [all data]

Choi, 2003
Choi, H.-S., Character impact odorants of Citrus Hallabong [(C. unshiu Marcov × C. sinensis Osbeck) × C. reticulata Blanco] cold-pressed peel oil, J. Agric. Food Chem., 2003, 51, 9, 2687-2692, https://doi.org/10.1021/jf021069o . [all data]

Gancel, Ollitrault, et al., 2003
Gancel, A.-L.; Ollitrault, P.; Froelicher, Y.; Tomi, F.; Jacquemond, C.; Luro, F.; Brillouet, J.-M., Leaf volatile compounds of seven citrus somatic tetraploid hybrids sharing willow leaf mandarin (Citrus deliciosa Ten.) as their common parent, J. Agric. Food Chem., 2003, 51, 20, 6006-6013, https://doi.org/10.1021/jf0345090 . [all data]

bin Jantan, Yassin, et al., 2003
bin Jantan, I.; Yassin, M.S.M.; Chin, C.B.; Chen, L.L.; Sim. N.L., Antifungal activity of the essential oils of nine Zingiberaceae species, Pharm. Biol., 2003, 41, 5, 392-397, https://doi.org/10.1076/phbi.41.5.392.15941 . [all data]

Skaltsa, Demetzos, et al., 2003
Skaltsa, H.D.; Demetzos, C.; Lazari, D.; Sokovic, M., Essential oil analysis and antimicrobial activity of eight Stachys species from Greece, Phytochemistry, 2003, 64, 3, 743-752, https://doi.org/10.1016/S0031-9422(03)00386-8 . [all data]

Tsiri, Kretsi, et al., 2003
Tsiri, D.; Kretsi, O.; Chinou, I.B.; Spyropoulos, C.G., Composition of fruit volatiles and annual changes in the volatiles of leaves of Eucalyptus camaldulensis Dehn. growing in Greece, Flavour Fragr. J., 2003, 18, 3, 244-247, https://doi.org/10.1002/ffj.1220 . [all data]

Cavaleiro, Salgueiro, et al., 2002
Cavaleiro, C.; Salgueiro, L.R.; Antunes, T.; Sevinate-Pinto, I.; Barroso, J.G., Composition of the essential oil and micromorphology of trichomes of Teucrium salviastrum, an endemic species from Portugal, Flavour Fragr. J., 2002, 17, 4, 287-291, https://doi.org/10.1002/ffj.1068 . [all data]

Demetzos, Angelopoulou, et al., 2002
Demetzos, C.; Angelopoulou, D.; Perdetzoglou, D., A comparative study of the essential oils of Cistus salviifolius in several populations of Crete (Greece), Biochem. Syst. Ecol., 2002, 30, 7, 651-665, https://doi.org/10.1016/S0305-1978(01)00145-4 . [all data]

bin Jantan and bin Ahmad, 2002
bin Jantan, I.; bin Ahmad, F., Chemical constituents of the essential oils of Goniothalamus malayanus Hook. f. and Thoms., Flavour Fragr. J., 2002, 17, 5, 372-374, https://doi.org/10.1002/ffj.1107 . [all data]

Mondello, Zappia, et al., 2002
Mondello, L.; Zappia, G.; Cotroneo, A.; Bonaccorsi, I.; Chowdhury, J.U.; Yusuf, M.; Dugo, G., Studies on the essential oil-bearing plants of Bangladesh. Part VIII. Composition of some Ocimum oils O. basilicum L. var. purpurascens; O. sanctum L. green; O. sanctum L. purple; O. americanum L., citral type; O. americanum L., camphor type, Flavour Fragr. J., 2002, 17, 5, 335-340, https://doi.org/10.1002/ffj.1108 . [all data]

Nath, Sarma, et al., 2002
Nath, S.C.; Sarma, K.K.; Vajezikova, I.; Leclercq, P.A., Comparison of volatile inflorescence oils and taxonomy of certain Cymbopogon taxa described as Cymbopogon flexuosus (Nees ex Steud.) Wats., Biochem. Syst. Ecol., 2002, 30, 2, 151-162, https://doi.org/10.1016/S0305-1978(01)00066-7 . [all data]

Pino, Marbot, et al., 2002
Pino, J.A.; Marbot, R.; Quert, R.; García, H., Study of essential oils of Eucalyptus resinifera Smith, E. tereticornis Smith and Corymbia maculata (Hook.) K.D. Hill L.A.S. Johnson, grown in Cuba, Flavour Fragr. J., 2002, 17, 1, 1-4, https://doi.org/10.1002/ffj.1026 . [all data]

Pino, Marbot, et al., 2002, 2
Pino, J.A.; Marbot, R.; Bello, A., Volatile compounds of Psidium salutare (H.B.K.) Berg. fruit, J. Agric. Food Chem., 2002, 50, 18, 5146-5148, https://doi.org/10.1021/jf0116303 . [all data]

Nogueira, Bittrich, et al., 2001
Nogueira, P.C.L.; Bittrich, V.; Shepherd, G.J.; Lopes, A.V.; Marsaioli, A.J., The ecological and taxonomic importance of flower volatiles of Clusia species (Guttiferae), Phytochemistry, 2001, 56, 5, 443-452, https://doi.org/10.1016/S0031-9422(00)00213-2 . [all data]

Rezzi, Cavaleiro, et al., 2001
Rezzi, S.; Cavaleiro, C.; Bighelli, A.; Salgueiro, L.; da Cunha, A.P.; Casanova, J., Intraspecific chemical variability of the leaf essential oil of Juniperus phoenicea subsp. turbinata from Corsica, Biochem. Syst. Ecol., 2001, 29, 2, 179-188, https://doi.org/10.1016/S0305-1978(00)00044-2 . [all data]

Skaltsa, Mavrommati, et al., 2001
Skaltsa, H.D.; Mavrommati, A.; Constantinidis, T., A chemotaxonomic investigation of volatile constituents in Stachys subsect. Swainsonianeae (Labiatae), Phytochemistry, 2001, 57, 2, 235-244, https://doi.org/10.1016/S0031-9422(01)00003-6 . [all data]

Bartley and Jacobs, 2000
Bartley, J.P.; Jacobs, A.L., Effects of drying on flavour compounds in Australian-grown ginger (Zingiber officinale), J. Sci. Food Agric., 2000, 80, 2, 209-215, https://doi.org/10.1002/(SICI)1097-0010(20000115)80:2<209::AID-JSFA516>3.0.CO;2-8 . [all data]

Maia, de Paula, et al., 2000
Maia, B.H.L.N.S.; de Paula, J.R.; Sant'Ana, J.; da Silva, M.F.G.F.; Fernandes, J.B.; Vieira, P.C.; Costa, M.S.S.; Ohashi, O.S.; Silva, J.N.M., Essential oils of Toona and Cedrela species (Meliaceae): Taxonomic and ecological implications, J. Braz. Chem. Soc., 2000, 11, 6, 629-639, https://doi.org/10.1590/S0103-50532000000600012 . [all data]

Song, Sawamura, et al., 2000
Song, H.S.; Sawamura, M.; Ito, T.; Kawashimo, K.; Ukeda, H., Quantitative determination of characteric flavour of Citrus junos (yuzu) peel oil, Flavour Fragr. J., 2000, 15, 4, 245-250, https://doi.org/10.1002/1099-1026(200007/08)15:4<245::AID-FFJ904>3.0.CO;2-V . [all data]

Song, Sawamura, et al., 2000, 2
Song, H.S.; Sawamura, M.; Ito, T.; Ido, A.; Ukeda, H., Quantitative determination and characteristic flavour of daidai (Citrus aurantium L. var. cyathifera Y. Tanaka) peel oil, Flavour Fragr. J., 2000, 15, 5, 323-328, https://doi.org/10.1002/1099-1026(200009/10)15:5<323::AID-FFJ918>3.0.CO;2-J . [all data]

Verzera, Trozzi, et al., 2000
Verzera, A.; Trozzi, A.; Cotroneo, A.; Lorenzo, D.; Dellacassa, E., Uruguayan essential oil. 12. Composition of Nova and Satsuma mandarin oils, J. Agric. Food Chem., 2000, 48, 7, 2903-2909, https://doi.org/10.1021/jf990734z . [all data]

Muselli, Hoi, et al., 1999
Muselli, A.; Hoi, T.M.; Cu, L.D.; Moi, L.D.; Bessière, J.-M.; Bighelli, A.; Casanova, J., Composition of the essential oil of Acanthopanax trifoliatus (L.) Merr. (Araliacaea) from Vietnam, Flavour Fragr. J., 1999, 14, 1, 41-44, https://doi.org/10.1002/(SICI)1099-1026(199901/02)14:1<41::AID-FFJ781>3.0.CO;2-B . [all data]

Stashenko, Cervantes, et al., 1999
Stashenko, E.E.; Cervantes, M.; Combariza, Y.; Fuentes, H.; Martínez, J.R., HRGC/FID and HRGC/MSD analysis of the secondary metabolites obtained by different extraction methods from Lepechinia schiedeana, an in vitro evaluation of its antioxidant activity, J. Hi. Res. Chromatogr., 1999, 22, 6, 343-349, https://doi.org/10.1002/(SICI)1521-4168(19990601)22:6<343::AID-JHRC343>3.0.CO;2-J . [all data]

Sumathykutty, Rao, et al., 1999
Sumathykutty, M.A.; Rao, J.M.; Padmakumari, K.P.; Narayanan, C.S., Essential oil constituents of some Piper species, Flavour Fragr. J., 1999, 14, 5, 279-282, https://doi.org/10.1002/(SICI)1099-1026(199909/10)14:5<279::AID-FFJ821>3.0.CO;2-0 . [all data]

Nogueira, Marsaioli, et al., 1998
Nogueira, P.C.L.; Marsaioli, A.J.; Amaral, M.C.E.; Bittrich, V., The fragrant floral oils of Tovomita species, Phytochemistry, 1998, 49, 4, 1009-1012, https://doi.org/10.1016/S0031-9422(97)01046-7 . [all data]

Bicchi, Fresia, et al., 1997
Bicchi, C.; Fresia, M.; Rubiolo, P.; Monti, D.; Franz, C.; Goehler, I., Constituents of Tagetes lucida Cav. ssp. lucida essential oil, Flavour Fragr. J., 1997, 12, 1, 47-52, https://doi.org/10.1002/(SICI)1099-1026(199701)12:1<47::AID-FFJ610>3.0.CO;2-7 . [all data]

Stashenko, Prada, et al., 1996
Stashenko, E.E.; Prada, N.Q.; Martínez, J.R., HRGC/FID/NP and HRGC/MSD study of Colombian Ylang-Ylang (Cananga odorata) oils obtained by different extraction techniques, J. Hi. Res. Chromatogr., 1996, 19, 6, 353-358, https://doi.org/10.1002/jhrc.1240190609 . [all data]

Stashenko, Villa, et al., 1995
Stashenko, E.E.; Villa, H.S.; Combariza, M.Y., Comparative study of Colombian rue oils by high resolution gas chromatography using different detection systems, J. Microcolumn Sep., 1995, 7, 2, 117-122, https://doi.org/10.1002/mcs.1220070204 . [all data]

Bartley and Foley, 1994
Bartley, J.P.; Foley, P., Supercritical fluid extraction of Australian-grown ginger (Zingiber officinale), J. Sci. Food Agric., 1994, 66, 3, 365-371, https://doi.org/10.1002/jsfa.2740660314 . [all data]

Yang, Sugisawa, et al., 1992
Yang, R.; Sugisawa, H.; Nakatani, H.; Tamura, H.; Takagi, N., Comparison of odor quality in peel oils of acid citrus, Nippon Shokuhin Kogyo Gakkaishi, 1992, 39, 1, 16-24, https://doi.org/10.3136/nskkk1962.39.16 . [all data]

Andriamaharavo, 2014
Andriamaharavo, N.R., Retention Data. NIST Mass Spectrometry Data Center., NIST Mass Spectrometry Data Center, 2014. [all data]

Cardeal, da Silva, et al., 2006
Cardeal, Z.L.; da Silva, M.D.R.G.; Marriott, P.J., Comprehensive two-dimensional gas chromatography/mass spectrometric analysis of pepper volatiles, Rapid Commun. Mass Spectrom., 2006, 20, 19, 2823-2836, https://doi.org/10.1002/rcm.2665 . [all data]

Moon, Cliff, et al., 2006
Moon, S.-Y.; Cliff, M.A.; Li-Chan, E.C.Y., Odour-active components of simulated beef flavour analysed by solid phase microextraction and gas chromatography-mass spectrometry and -olfactometry, Food Res. Int., 2006, 39, 3, 294-308, https://doi.org/10.1016/j.foodres.2005.08.002 . [all data]

Suliman F.E.O., Fatope M.O., et al., 2006
Suliman F.E.O.; Fatope M.O.; Al-Saidi S.H.; Al-Kindy S.M.Z.; Marwah R.G., Composition and antimicrobial activity of the essential oil of Pluchea arabica from Oman, Flavour Fragr. J., 2006, 21, 3, 469-471, https://doi.org/10.1002/ffj.1616 . [all data]

Filippini, Tomi, et al., 2000
Filippini, M.-H.; Tomi, F.; Casanova, J., Composition of the leaf oil of Ferula arrigonii Bocchieri, Flavour Fragr. J., 2000, 15, 3, 195-198, https://doi.org/10.1002/1099-1026(200005/06)15:3<195::AID-FFJ891>3.0.CO;2-6 . [all data]

Lorenzo, Dellacassa, et al., 2000
Lorenzo, D.; Dellacassa, E.; Atti-Serafini, L.; Santos, A.C.; Frizzo, C.; Paroul, N.; Moyna, P.; Mondello, L.; Dugo, G., Composition and stereoanalysis of Cymbopogon winterianus Jowitt oil from Southern Brazil, Flavour Fragr. J., 2000, 15, 3, 177-181, https://doi.org/10.1002/1099-1026(200005/06)15:3<177::AID-FFJ887>3.0.CO;2-M . [all data]

Njoroge, Koaze, et al., 2005
Njoroge, S.M.; Koaze, H.; Karanja, P.N.; Sawamura, M., Volatile Constituents of Redblush Grapefruit ( Citrus paradisi) and Pummelo ( Citrus grandis) Peel Essential Oils from Kenya, J. Agric. Food Chem., 2005, 53, 25, 9790-9794, https://doi.org/10.1021/jf051373s . [all data]

Brophy, Goldsack, et al., 2000
Brophy, J.; Goldsack, R.J.; Bean, A.R.; Forster, P.I.; Lepschi, B.J., Leaf essential oils of the genus Leptospermum (Myrtaceae) in eastern Australia. Part 6. Leptospermum polygalifolium and allies, Flavour Fragr. J., 2000, 15, 4, 271-277, https://doi.org/10.1002/1099-1026(200007/08)15:4<271::AID-FFJ910>3.0.CO;2-E . [all data]

Brophy, Goldsack, et al., 2000, 2
Brophy, J.J.; Goldsack, R.J.; Punruckvong, A.; Bean, A.R.; Forster, P.I.; Lepschi, B.J.; Doran, J.C.; Rozefelds, A.C., Leaf essential oils of the genus Leptospermum (Myrtaceae) in eastern Australia. Part 7. Leptospermum petersonii, L. liversidgei and allies, Flavour Fragr. J., 2000, 15, 5, 342-351, https://doi.org/10.1002/1099-1026(200009/10)15:5<342::AID-FFJ924>3.0.CO;2-V . [all data]

Chagonda, Makanda, et al., 2000
Chagonda, L.S.; Makanda, C.D.; Chalchat, J.-C., The essential oils of Ocimum canum Sims (basilic camphor) and Ocimum urticifolia Roth from Zimbabwe, Flavour Fragr. J., 2000, 15, 1, 23-26, https://doi.org/10.1002/(SICI)1099-1026(200001/02)15:1<23::AID-FFJ866>3.0.CO;2-W . [all data]

Choi and Sawamura, 2000
Choi, H.-S.; Sawamura, M., Composition of the essential oil of Citrus tamurana Hort. ex Tanaka (Hyuganatsu), J. Agric. Food Chem., 2000, 48, 10, 4868-4873, https://doi.org/10.1021/jf000651e . [all data]

Brophy, Goldsack, et al., 1999
Brophy, J.J.; Goldsack, R.J.; Bean, A.R.; Forster, P.I.; Lepschi, B.J., Leaf essential oils of the genus Leptospermum (Myrtaceae) in eastern Australia. Part 5. Leptospermum continentale and allies, Flavour Fragr. J., 1999, 14, 2, 98-104, https://doi.org/10.1002/(SICI)1099-1026(199903/04)14:2<98::AID-FFJ797>3.0.CO;2-V . [all data]

Chyau, Mau, et al., 1996
Chyau, C.-C.; Mau, J.-L.; Wu, C.-M., Characteristics of the steam-distilled oil and carbon dioxide extract of Zanthoxylum simulans and fruits, J. Agric. Food Chem., 1996, 44, 4, 1096-1099, https://doi.org/10.1021/jf950577d . [all data]

Chen and Ho, 1988
Chen, C.-C.; Ho, C.-T., Gas chromatographic analysis of volatile components of ginger oil (Zingiber officinale Roscoe) extracted with liquid carbon dioxide, J. Agric. Food Chem., 1988, 36, 2, 322-328, https://doi.org/10.1021/jf00080a020 . [all data]

Lorenzo, Paz, et al., 2005
Lorenzo, D.; Paz, D.; Davies, P.; Villamil, J.; Vila, R.; Canigueral, S.; Dellacassa, E., Application of Multidimensional Gas Chromatography to the Enantioselective Characterisation of the Essential Oil of Eupatorium buniifolium Hooker et Arnott, Phytochem. Anal., 2005, 16, 1, 39-44, https://doi.org/10.1002/pca.808 . [all data]

Bisio, Ciarallo, et al., 1998
Bisio, A.; Ciarallo, G.; Romussi, G.; Fontana, N.; Mascolo, N.; Capasso, R.; Biscardi, D., Chemical Composition of Essential Oils from some Salvia species, Phytother. Res., 1998, 12, S1, s117-s120, https://doi.org/10.1002/(SICI)1099-1573(1998)12:1+3.0.CO;2-2 . [all data]

Pinheiro, de Queiros, et al., 2013
Pinheiro, P.F.; de Queiros, V.T.; Rondelli, V.M.; Costa, A.V.; MArcelino, T. deP.; Pratissoli, D., Insecticidal activity of citronells grass essential oil on Frankliniella schultzei and Myzus persicae, Cienc. Agrotec. Lavras, 2013, 37, 2, 138-144, https://doi.org/10.1590/S1413-70542013000200004 . [all data]

Pripdeevech and Saansoomchai, 2013
Pripdeevech, P.; Saansoomchai, J., Antibacterial activity and chemical composition of essential oil and various extracts of Fagraea fragrans Roxb. flowers, Chiang Mai J. Sci., 2013, 40, 2, 214-223. [all data]

Boukhris, Bouaziz, et al., 2012
Boukhris, M.; Bouaziz, M.; Feki, I.; Jemai, H.; El Feki, A.; Sayadi, S., Hypoglycemic and antioxidant effects of leaf essential oil of Pelargonium graveolens L'Her. in alloxan induced diabetic rats, Lipids in Health and Disease, 2012, 11, 1, 1-10, https://doi.org/10.1186/1476-511X-11-81 . [all data]

Phungpanya, Thongpoon, et al., 2012
Phungpanya, C.; Thongpoon, C.; Pripdeevech, P.; Machan, T., Analysis of aroma volatiles from fresh leaves of Plectranthus amboinicus using solid phase microextraction (SPME) technique, Pure and Applied Chemistry International Conference 2012 (PACCON 2012), 2012, 16701672. [all data]

Zouari, Ayadi, et al., 2012
Zouari, N.; Ayadi, I.; Fakhfakh, N.; Rebai, A.; Zouari, S., Variations of chemical composition of essential oils in wild-populations of Thymus algeriensis Boiss et Reut., a North African endemic species, Lipids in Health and Desease, 2012, 11, 1, 28-39, https://doi.org/10.1186/1476-511X-11-28 . [all data]

Cui, Yang, et al., 2011
Cui, J.; Yang, X.; Dong, A.-J.; Cheng, D.-Y.; Wang, J.; Zhao, H.-T.; Xu, R.-B.; Wang, P.; Li, W.-J., Chemical composition and antioxidant activity of Wuphorbia fischeriana essential oil from China, J. Med. Plants Res., 2011, 5, 19, 4894-4798. [all data]

Mothana, Hasson, et al., 2011
Mothana, R.A.A.; Hasson, S.S.; Schultze, W.; Mowitz, A.; Lindequist, U., Phytochemical composition and in vitro antimicrobial and antioxidant activities of essential oils of three endemic Soqotraen Boswellia species, Food Chem., 2011, 126, 3, 1149-1154, https://doi.org/10.1016/j.foodchem.2010.11.150 . [all data]

Bi Kouame, Bedi, et al., 2010
Bi Kouame, F.P.; Bedi, G.; Koffi, A.M.; Chalchat, J.C.; Guessan, T.Y.N., Volatile constituents from leaves of Morinda morindoides (Rubiaceae): a medicinal plant from the Ivory Coast, The Open Nat. Prod. J., 2010, 3, 1, 6-9, https://doi.org/10.2174/1874848101003010006 . [all data]

Cavar, Maksimovic, et al., 2010
Cavar, S.; Maksimovic, M.; Solic, M.E., Comparison of essential oil composition of Stachys menthufolia Vis. from two natural habitas in Croatia, Biologica Nyssana, 2010, 1, 1-2, 99-103. [all data]

Ho, Wang, et al., 2010
Ho, C.-L.; Wang, E.I.-C.; Yu, H.-T.; Yu, H.-M.; Su, Y.-C., Composition amd antioxidant activities of essential oils of different tissues from Cryptomeria japonica D. Don, Quarterly J. Chin. Forestry, 2010, 32, 1, 63-76. [all data]

Mirjalili, Salehi, et al., 2010
Mirjalili, M.H.; Salehi, P.; Sonboli, A.; HAdian, J.; Ebrahimi, S.N.; Yousefzadi, M., The composition and antibacterial activity of the essential oil of Levisticum officinale Koch flowers and fruits at different developmental stages, J. Serb. Chem. Soc., 2010, 75, 12, 1661-1669, https://doi.org/10.2298/JSC100524126M . [all data]

Monsef-Esfahani, Miri, et al., 2010
Monsef-Esfahani, H.R.; Miri, A.; Amini, M.; Amanzadeh, Y.; Hadjiakhoondi, A.; Hajiaghaee, R.; Ajani, Y., Seasonal variations in the chemical composition, antioxidant activity and total phenolic content of Teucrium persicum Boiss. essential oils, Res. J. Biol. Sci., 2010, 5, 7, 492-498, https://doi.org/10.3923/rjbsci.2010.492.498 . [all data]

Radulovic, Dordevic, et al., 2010
Radulovic, N.; Dordevic, N.; Markovic, M.; Palic, R., Volatile constituents of Glechoma Hirsuta Waldst. Kit. and G. Hederacea L. (Lamiaceae), Bull. Chem. Soc. Ethiop., 2010, 24, 1, 67-76, https://doi.org/10.4314/bcse.v24i1.52962 . [all data]

Benites, Moiteiro, et al., 2009
Benites, J.; Moiteiro, C.; Miguel, G.; Rojo, L.; Lopez, J.; Venancio, F.; Ramalho, L.; Feio, S.; Dandlen, S.; Casanova, H.; Torres, I., Composition and biological activity of the essential oil of Peruvial Lantana camara, J. Chilean Chem. Soc., 2009, 54, 4, 379-384, https://doi.org/10.4067/S0717-97072009000400012 . [all data]

Hnawia, Menut, et al., 2009
Hnawia, E.; Menut, C.; Agrebi, A.; Cabalion, P., Wood essential oil of two endemic trees from New Caledonia: Callitris sulcata (Parl.) Schltr. and Callitris neocaledonica Dummer, Biochem. Systematics Ecol., 2009, 36, 11, 859-866, https://doi.org/10.1016/j.bse.2008.08.007 . [all data]

Ho, Wang, et al., 2009
Ho, C.-L.; Wang, E.I.-C.; Su, Y.-C., Essential oil compositions and bioactivities of the various parts of Cinnamomum camphora Sieb. var. linallolifera Fujuta, Journal title only in Chinese, 2009, 31, 2, 77-96. [all data]

Koba, Sanda, et al., 2009
Koba, K.; Sanda, K.; Guyon, C.; Raynaud, C.; Chaumont, J.-P.; Nicod, L., In vitro cytotoxic activity of Cymbopogon citratus L. and Cymbopogon nardus L. essential oils from Togo, J. Bangladesh Pharmacological Soc., 2009, 4, 29-34. [all data]

Museli, Pau, et al., 2009
Museli, A.; Pau, M.; Desjobert, J.-M.; Foddai, M.; Usai, M.; Costa, J., Volatile constituents of Achllea ligustica All. by HS-SPME/GC/GC-MS. Comparison with essential oils obtained by hydrodistillation from Corsica and Sardinia, Chromatographia, 2009, 69, 5/6, 575-585, https://doi.org/10.1365/s10337-008-0939-1 . [all data]

Scrivanti, Anton, et al., 2009
Scrivanti, L.R.; Anton, A.M.; Zygadlo, J.A., Essential oil conposition of Bothriochloa Kuntze (Poaceae) from South America and their chemotaxonomy, Biochem. Systematics Ecol., 2009, 37, 3, 206-213, https://doi.org/10.1016/j.bse.2009.03.009 . [all data]

Soleimani and Azar, 2009
Soleimani, M.; Azar, P.A., Volatile composition of Ruta graveolens L. of North of Iran, World Appl. Sci. J., 2009, 7, 1, 124-126. [all data]

Adams, Beauchamp, et al., 2007
Adams, R.P.; Beauchamp, P.S.; Dev, V.; Dutz, S.M., New Natural Products Isolated from One-Seeded Juniperus of the Southwestern United States: Isolation and Occurence of 2-Ethenyl-3-methyl Phanol and Its Derivatives, J. Essent. Oil Res., 2007, 19, 2, 146-152, https://doi.org/10.1080/10412905.2007.9699247 . [all data]

Amiri, 2007
Amiri, H., Quantative and qualative changes of essential oil of Salvia bracteata BAnk et Sol. in different growth stages, DARU, 2007, 15, 2, 79-82. [all data]

Bos, Woerdenbag, et al., 2007
Bos, R.; Woerdenbag, H.J.; Kayser, O.; Quax, W.J.; Ruslan, K.; Elfami, Essential oil constituents of Piper cubeba L. fils. from Indonesia, J. Essent. Oil Res., 2007, 19, 1, 14-17, https://doi.org/10.1080/10412905.2007.9699217 . [all data]

Capetanos, Saroglou, et al., 2007
Capetanos, C.; Saroglou, V.; Marin, P.D.; Simic, A.; Skaltsa, H.D., Essential oil snalysis of two endemic Eringium species from Serbia, J. Serb. Chem. Soc., 2007, 72, 10, 961-965, https://doi.org/10.2298/JSC0710961C . [all data]

Cheraif, Ben Jannet, et al., 2007
Cheraif, I.; Ben Jannet, H.; Hammami, M.; Khouja, M.L.; Mighri, Z., Chemical composition and antimicrobial activity of essential oils of Cupressus arizonica Greene, Biochem. Syst. Ecol., 2007, 35, 12, 813-820, https://doi.org/10.1016/j.bse.2007.05.009 . [all data]

Cho, Abd El-Aty, et al., 2007
Cho, S.-K.; Abd El-Aty, A.M.; Choi, J.-H.; Kim, M.R.; Shim, J.H., Optimized conditions for the extraction of secondary volatile metabolites in Angelica roots by accelerated solvent extraction, J. Pharm. Biomed. Anal., 2007, 44, 5, 1154-1158, https://doi.org/10.1016/j.jpba.2007.03.011 . [all data]

Elfami, Bos, et al., 2007
Elfami; Bos, R.; Ruslan, K.; Woerdenbag, H.J.; Kayser, P.; Quax, W.J., Essential Oil Constituents of Piper cubeba from Indonesia, 2007, 53-60. [all data]

Farsam, Amanlou, et al., 2007
Farsam, H.; Amanlou, M.; Taghi-Cheetsaz, N.; Amin, G.R.; Saledi-Sormaghi, M.H., Essential Oil of Chimonanthus fragrans flowers Population of Tehran, DARU, 2007, 15, 3, 129-131. [all data]

Jerkovic, Mastelic, et al., 2007
Jerkovic, I.; Mastelic, J.; Marijanovic, Z., Bound volatile compounds and essential oil from the fruit of Maclura pomifera (Raf.) Schneid. (osage orange), Flavour Fragr. J., 2007, 22, 1, 84-88, https://doi.org/10.1002/ffj.1763 . [all data]

Miyazawa and Tamura, 2007
Miyazawa, M.; Tamura, N., Components of the essential oil from sprouts of Polygonum hydropiper L. ('Benitade'), Flavour Fragr. J., 2007, 22, 3, 188-190, https://doi.org/10.1002/ffj.1779 . [all data]

Sefidkon, Abbasi, et al., 2007
Sefidkon, F.; Abbasi, K.; Jamzad, Z.; Ahmadi, S., The effect of distillation methods and stage of plant growth on the essential oil content and composition of Satureja rechingeri Jamzad, Food Chem., 2007, 100, 3, 1054-1058, https://doi.org/10.1016/j.foodchem.2005.11.016 . [all data]

Sylvestre, Pichette, et al., 2007
Sylvestre, M.; Pichette, A.; Longtin, A.; Martin, M.-A.C.; Bercion, S.R.; Legault, J., Chemical composition of leaf essential oil of Hedyosmum arborescens and evaluation of its anticancer activity, Natural Product Communications, 2007, 2, 12, 1269-1272. [all data]

Zizovic, Stamenic, et al., 2007
Zizovic, I.; Stamenic, M.; Ivanovic, J.; Orlovic, A.; Ristic, M.; Djordjevic, S.; Petrovic, S.D.; Skala, D., Supercritical carbon dioxide extraction of sesquiterpenes from valerian root, J. Supercrit. Fluids, 2007, 43, 2, 249-258, https://doi.org/10.1016/j.supflu.2007.05.007 . [all data]

Abdelwahed, Hayder, et al., 2006
Abdelwahed, A.; Hayder, N.; Kilani, S.; Mahmoud, A.; Chibani, J.; Hammami, M.; Chekir-Ghedira, L.; Ghedira, K., Chemical composition and antimicrobial activity of essential oils from Tunisian Pituranthos tortuosus (Coss.) Maire, Flavour Fragr. J., 2006, 21, 1, 129-133, https://doi.org/10.1002/ffj.1542 . [all data]

Boti, Yao, et al., 2006
Boti, J.B.; Yao, P.A.; Koukoua, G.; N'Guessan, T.Y.; Casanova, J., Components and chemical variability of Isolona campanulata Engler Diels leaf oil, Flavour Fragr. J., 2006, 21, 1, 166-170, https://doi.org/10.1002/ffj.1555 . [all data]

Cavaleiro, Pinto, et al., 2006
Cavaleiro, C.; Pinto, E.; Gonsales, M.J.; Salguero, L., Antifungal activity of Juniperus essential oils agains dermatophyte, Asrgillus and Candida strains, J. Appl. Microbiol., 2006, 100, 6, 1333-1338, https://doi.org/10.1111/j.1365-2672.2006.02862.x . [all data]

Champagnat, Figueredo, et al., 2006
Champagnat, P.; Figueredo, G.; Chalchat, J.-C.; Bessiere, J.-M., Essential oil composition of Vetiveria nigritana from Mali, J. Essent. Oil Res., 2006, 18, 6, 647-649, https://doi.org/10.1080/10412905.2006.9699193 . [all data]

Elfami, Komar, et al., 2006
Elfami, R.B.; Komar, R.; Woerdenbag, H.J.; Kayser, P.; Quax, W.J., Essential oil constituents of Piper cubeba from Indonesia, 2006, retrieved from http://dissertations.ub.rug.nl/FILES/facultiew/science/2006/elfahmi/05c5.pdf. [all data]

Fernandez, Pintaric, et al., 2006
Fernandez, X.; Pintaric, C.; Lizzani-Cuvelier, L.; Loiseau, A.-M.; Morello, A.; Pellerin, P., Chemical composition of absolute and supercritical carbon dioxide extract of Aframomum melegueta, Flavour Fragr. J., 2006, 21, 1, 162-165, https://doi.org/10.1002/ffj.1554 . [all data]

Hymete, Rohloff, et al., 2006
Hymete, A.; Rohloff, J.; Iversen, T.-H., Essential oil from seeds and husks of Aframomum corrorima from Ethiopia, Flavour Fragr. J., 2006, 21, 4, 642-644, https://doi.org/10.1002/ffj.1634 . [all data]

Kim, Abd El-Aty, et al., 2006
Kim, M.R.; Abd El-Aty, A.M.; Kim, I.S.; Shim, J.H., Determination of volatile flavor components in danggui cultivars by solvent free injection and hydrodistillation followed by gas chromatographic-mass spectrometric analysis, J. Chromatogr. A, 2006, 1116, 1-2, 259-264, https://doi.org/10.1016/j.chroma.2006.03.060 . [all data]

Kim, El-Aty, et al., 2006
Kim, M.R.; El-Aty, A.M.A.; Choi, J.-H.; Lee, K.B.; Shim, J.H., Identification of volatile components in Angelica species using supercritical-CO2 fluid extraction and solid phase microextraction coupled to gas chromatography-mass spectrometry, Biomedical Chromatography, 2006, 20, 11, 1267-1273, https://doi.org/10.1002/bmc.696 . [all data]

Lesueur, Ban, et al., 2006
Lesueur, D.; Ban, N.K.; Bighelli, A.; Muselli, A.; Casanova, J., Analysis of the root oil of Fokienia hodginsii (Dunn) Henry et Thomas (Cupressaceae) by GC, GC-MS and 13C-NMR, Flavour Fragr. J., 2006, 21, 1, 171-174, https://doi.org/10.1002/ffj.1557 . [all data]

Lis and Milczarek, 2006
Lis, A.; Milczarek, J., Chemical composition of the essential oils from fruits, leaves and flowers of Phellodendron sachalinense (Fr. Schmidt) Sarg., Flavour Fragr. J., 2006, 21, 4, 683-686, https://doi.org/10.1002/ffj.1662 . [all data]

Ouamba, Ouabonzi, et al., 2006
Ouamba, J.-M.; Ouabonzi, A.; Ekouya, A.; Bessière, J.-M.; Menut, C.; Abena, A.A.; Banzouzi, J.-T., Volatile constituents of the essential oil leaf of Lantana salvifolia Jacq. (Verbenaceae), Flavour Fragr. J., 2006, 21, 1, 158-161, https://doi.org/10.1002/ffj.1553 . [all data]

Pintore G., Chessa M., et al., 2006
Pintore G.; Chessa M.; Manconi P.; Zanetti S.; Deriu A.; Tirillini B., Chemical composition and antimicrobial activities of essential oil of stachys glutinosa L. from Sardinia, Natural Product Communications, 2006, 1, 12, 1133-1136. [all data]

Pino, Marbot, et al., 2006
Pino, J.A.; Marbot, R.; Payo, A.; Chao, D.; Herrera, P., Aromatic Plants from Western Cuba VII. Composition of the Leaf Oil of Psidium wrightii KRug et Urb., Lantana involucrata L., Cinnamonum montanum (Sw.) Berchtold et J. Persl. and Caesalpinia violacea (Mill.) Standley, J. Essent. Oil. Res., 2006, 18, 2, 170-174, https://doi.org/10.1080/10412905.2006.9699058 . [all data]

Potzernheim, Bizzo, et al., 2006
Potzernheim, M.C.L.; Bizzo, H.R.; Vieira, R.F., Analysis of the essential oil of three species of Piper collected in the region of the Distrito Federal (Cerrado - Brazilian Savannah) and comparison with oils of plants from region of Paraty, State of Rio de Janeiro (Atlantic Rain Forest), Brazilian Journal of Pharmacognosy, 2006, 16, 2, 246-251. [all data]

Sabulal, Dan, et al., 2006
Sabulal, B.; Dan, M.; Pradeep, N.S.; Valsamma, R.K.; George, V., Composition and antimicrobial activity of essential oil from the fruits of Amomum cannicarpum, Acta Pharm. Sin., 2006, 56, 473-480. [all data]

Sonboli, Mirjalili, et al., 2006
Sonboli, A.; Mirjalili, M.H.; Yousefzadi, M., Antimicrobial activity and composition of the essential oil of Cymbopogon Olivieri (Boiss.) Bor from Iran, Iranian J. Pharm. Res., 2006, 1, 65-68. [all data]

Tohar, Mohd, et al., 2006
Tohar, N.; Mohd, M.A.; Jantan, I.; Awang, K., A comparative study of the essential oils of the genus Plumeria Linn. from Malaysia, Flavour Fragr. J., 2006, 21, 6, 859-863, https://doi.org/10.1002/ffj.1617 . [all data]

Tonzibo, Coffy, et al., 2006
Tonzibo, Z.F.; Coffy, A.A.; Chalachat, J.C.; N'guessan, Y.T., Chemical composition of essential oils of Hoslundia opposita Vahl. from Ivory Coast., Flavour Fragr. J., 2006, 21, 5, 789-791, https://doi.org/10.1002/ffj.1715 . [all data]

Chagonda and Chalchat, 2005
Chagonda, L.S.; Chalchat, J.-C., The essential oil of wild and cultivated Hoslundia opposita Vahl. from Zimbabwe, Flavour Fragr. J., 2005, 20, 2, 193-195, https://doi.org/10.1002/ffj.1402 . [all data]

Duarte, Figueira, et al., 2005
Duarte, M.C.T.; Figueira, G.M.; Sartoratto, A.; Rehder, V.L.G.; Delarmelina, C., Anti-Candida activity of Brazilian medicinal plants, J. Ethnopharmacol., 2005, 97, 2, 305-311, https://doi.org/10.1016/j.jep.2004.11.016 . [all data]

Gauvin and Smadja, 2005
Gauvin, A.; Smadja, J., Essential oil composition of four Psiadia species from Reunion Island: A chemotaxonomic study, Biochem. Syst. Ecol., 2005, 33, 7, 705-714, https://doi.org/10.1016/j.bse.2004.12.013 . [all data]

Ghasemi Y., Faridi P., et al., 2005
Ghasemi Y.; Faridi P.; Mehregan I.; Mohagheghzadeh A., Ferula gummosa fruits: An aromatic antimicrobial agent, Chem. Nat. Compd. (Engl. Transl.), 2005, 41, 3, 311-314, https://doi.org/10.1007/s10600-005-0138-3 . [all data]

Marongiu, Piras, et al., 2005
Marongiu, B.; Piras, A.; Porcedda, S.; Scorciapino, A., Chemical composition of the essential oil and supercritical CO2 extract of Commiphora myrrha (Nees) Engl. and of Acorus calamus L., J. Agric. Food Chem., 2005, 53, 20, 7939-7943, https://doi.org/10.1021/jf051100x . [all data]

Morteza-Semnani and Saeedi, 2005
Morteza-Semnani, K.; Saeedi, M., The essential oil composition of Phlomis bruguieri Desf. from Iran, Flavour Fragr. J., 2005, 20, 3, 344-346, https://doi.org/10.1002/ffj.1459 . [all data]

de Oliveira, Dias, et al., 2005
de Oliveira, R.N.; Dias, I.J.M.; Câmara, C.A.G., Estudo comparativo do óleo essencial de Eugenia punicifolia (HBK) DC. de diferentes localidades de Pernambuco, Rev. Bras. Farmacogn., 2005, 15, 1, 39-43, https://doi.org/10.1590/S0102-695X2005000100009 . [all data]

Petrakis, Roussis, et al., 2005
Petrakis, P.V.; Roussis, V.; Papadimitriou, D.; Vagias, C.; Tsitsimpikou, C., The effect of terpenoid extracts from 15 pine species on the feeding behavioural sequence of the late instars of the pine processionary caterpillar Thaumetopoea pityocampa, Behav. Processes, 2005, 69, 3, 303-322, https://doi.org/10.1016/j.beproc.2004.12.008 . [all data]

Sajjadi, 2005
Sajjadi, S.E., Analysis of the essential oil of Nepeta sintenisii Bornm. from Iran, DARU, 2005, 13, 2, 61-64. [all data]

Setzer, Noletto, et al., 2005
Setzer, W.N.; Noletto, J.A.; Lawton, R.O.; Haber, W.A., Leaf essential oil composition of five Zanthoxylum species from Monteverde, Costa Rica, Molecular Diversity, 2005, 9, 1-3, 3-13, https://doi.org/10.1007/s11030-005-1298-6 . [all data]

Simoes-Pires C.A., Debenedetti S., et al., 2005
Simoes-Pires C.A.; Debenedetti S.; Spegazzini E.; Mentz L.A.; Matzenbacher N.I.; Limberger R.P.; Henriques A.T., Investigation of the essential oil from eight species of Baccharis belonging to sect. Caulopterae (Asteraceae, Astereae): a taxonomic approach, Plant Systematics and Evolution, 2005, 253, 1-4, 23-32, https://doi.org/10.1007/s00606-005-0296-6 . [all data]

Sonboli A., Fakhari A.R., et al., 2005
Sonboli A.; Fakhari A.R.; Sefidkon F., Chemical composition of the essential oil of Salvia macilenta from Iran, Chem. Nat. Compd. (Engl. Transl.), 2005, 41, 2, 168-170, https://doi.org/10.1007/s10600-005-0104-0 . [all data]

Sonboli, Salehi, et al., 2005
Sonboli, A.; Salehi, P.; Ebrahimi, S.N., Essential oil composition and antibacterial activity of the leaves of Stachys schtschegleevii from Iran, Chem. Nat. Compd. (Engl. Transl.), 2005, 41, 2, 171-175, https://doi.org/10.1007/s10600-005-0105-z . [all data]

Tzakou and Constantinidis, 2005
Tzakou, O.; Constantinidis, T., Chemotaxonomic significance of volatile compounds in Thymus samius and its related species Thymus atticus and Thymus parnassicus, Biochem. Syst. Ecol., 2005, 33, 11, 1131-1140, https://doi.org/10.1016/j.bse.2005.03.008 . [all data]

Agnaniet, Menut, et al., 2004
Agnaniet, H.; Menut, C.; Bessière, J.-M., Aromatic plants of tropical central Africa. Part XLIX: chemical composition of essential oils of the leaf and rhizome of Aframomum giganteum K. Schum from Gabon, Flavour Fragr. J., 2004, 19, 3, 205-209, https://doi.org/10.1002/ffj.1403 . [all data]

Choi, 2004
Choi, H.-S., Volatile constituents of satsuma mandarins growing in Korea, Flavour Fragr. J., 2004, 19, 5, 406-412, https://doi.org/10.1002/ffj.1283 . [all data]

paz Lima, Silva, et al., 2004
paz Lima, M.; Silva, T.M.D.; da Silva, J.D.; Zoghbi, M.G.B.; Andrade, E.H.A., Essential oil composition of leaf and fine stem of Aniba canelilla (Kunth) Mez from Manaus, Brazil., Acta Amazonica, 2004, 34, 2, 329-330, https://doi.org/10.1590/S0044-59672004000200019 . [all data]

Marongiu, Porcedda, et al., 2004
Marongiu, B.; Porcedda, A.P.S.; Casu, R.; Pierucci, P., Chemical composition of the oil and supercritical CO2 extract of Schinus molle L., Flavour Fragr. J., 2004, 19, 6, 554-558, https://doi.org/10.1002/ffj.1350 . [all data]

Mehrabani, Asadipour, et al., 2004
Mehrabani, M.; Asadipour, A.; Amoli, S.S., Chemical constituents of the essential oil of NEPETA DEPAUPERATA BENTH. from Iran, DARu: Journal of Faculty of Pharmacy, 2004, 12, 98-100. [all data]

Miyazawa, Fuhita, et al., 2004
Miyazawa, M.; Fuhita, T.; Yamafuji, C.; Matsui, M.; Kasahara, N.; Takagi, Y.; Ishikawa, Y., Chemical composition of volatile oil from the roots of Periploca sepium, J. Oleo Sci., 2004, 53, 10, 511-513, https://doi.org/10.5650/jos.53.511 . [all data]

Miyazawa, Fujita, et al., 2004
Miyazawa, M.; Fujita, T.; Yamafuji, C.; Matsui, M.; Kasahara, N.; Takagi, Y.; Ishikawa, Y., Chemical composition of volatile oil from the roots of Periploca sepium, J. Oleo Sci., 2004, 53, 11, 511-513, https://doi.org/10.5650/jos.53.511 . [all data]

Nik, Mirza, et al., 2004
Nik, Z.B.; Mirza, M.; Shahmir, F., Essential oil of Marrubium cuneatum Russell and its secretory elements, Flavour Fragr. J., 2004, 19, 3, 233-235, https://doi.org/10.1002/ffj.1293 . [all data]

Tirillini, Pellegrino, et al., 2004
Tirillini, B.; Pellegrino, R.; Bini, L.M., Essential oil composition of Stachys sylvatica L. from Italy, Flavour Fragr. J., 2004, 19, 4, 330-332, https://doi.org/10.1002/ffj.1308 . [all data]

Woerdenbag, Windono, et al., 2004
Woerdenbag, H.J.; Windono, T.; Bos, R.; Riswan, S.; Quax, W.J., Composition of the essential oils of Kaempferia rotunda L. and Kaempferia angustifolia Roscoe rhizomes from Indonesia, Flavour Fragr. J., 2004, 19, 2, 145-148, https://doi.org/10.1002/ffj.1284 . [all data]

Couladis, Özcan, et al., 2003
Couladis, M.; Özcan, M.; Tzakou, O.; Akgül, A., Comparative essential oil composition of various parts of the turpentine tree (Pistacia terebinthus L) growing wild in Turkey, J. Sci. Food Agric., 2003, 83, 2, 136-138, https://doi.org/10.1002/jsfa.1295 . [all data]

Fekam Boyom, Ngouana, et al., 2003
Fekam Boyom, F.; Ngouana, V.; Amvam Zollo, P.H.; Menut, C.; Bessiere, J.M.; Gut, J.; Rosenthal, P.J., Composition and anti-plasmodial activities of essential oils from some Cameroonian medicinal plants, Phytochemistry, 2003, 64, 7, 1269-1275, https://doi.org/10.1016/j.phytochem.2003.08.004 . [all data]

Ghasemi, Asghari, et al., 2003
Ghasemi, N.; Asghari, G.; Ardakani, M.S.; Siahpoush, A., Characterization of volatile constituents from aerial parts of varthemia persica DC (var. persica), Iran. J. Pharm. Res., 2003, 2, 241-243. [all data]

Jirovetz, Buchbauer, et al., 2003
Jirovetz, L.; Buchbauer, G.; Shafi, M.P.; Leela, N.K., Analysis of the essential oils of the leaves, stems, rhizomes and roots of the medicinal plant Alpinia galanga from southern India, Acta Pharm. Hung., 2003, 53, 73-81. [all data]

Marongiu, Porcedda, et al., 2003
Marongiu, B.; Porcedda, S.; Caredda, A.; de Gioannis, B.; Vargiu, L.; la Colla, P., Extraction of Juniperus oxycedrus ssp. Oxycedrus essential oil by supercritical carbon dioxide: influence of some process parameters and biological activity, Flavour Fragr. J., 2003, 18, 5, 390-397, https://doi.org/10.1002/ffj.1224 . [all data]

Mookdasanit, Tamura, et al., 2003
Mookdasanit, J.; Tamura, H.; Yoshizawa T.; Tokunaga T.; Nakanishi, K., Trace Volatile Compounds in Essential Oil of Citrus Sudachi by Means of Modified Solvent Extraction Method, Food Sci Technol. Res., 2003, 9, 1, 54-61, https://doi.org/10.3136/fstr.9.54 . [all data]

Morteza-Semnani and Saeedi, 2003
Morteza-Semnani, K.; Saeedi, M., Constituents of the essential oil of Commiphora myrrha (Nees) Engl. var. molmol, J. Essent. Oil Res., 2003, 15, 1, 50-51, https://doi.org/10.1080/10412905.2003.9712264 . [all data]

Pino, Marbot, et al., 2003
Pino, J.A.; Marbot, R.; Fuentes, V., Characterization of volatiles in Bullock's heart (Annona reticulata L.) fruit cultivars from Cuba, J. Agric. Food Chem., 2003, 51, 13, 3836-3839, https://doi.org/10.1021/jf020733y . [all data]

Sajjadi and Mehregan, 2003
Sajjadi, S.E.; Mehregan, I., Composition of the essential oil of Stachys Iaxa Boiss. Buhse, Iran. J. Pharm. Res., 2003, 57-58. [all data]

Senatore and Bruno, 2003
Senatore, F.; Bruno, M., Composition of the essential oil of Pallenis spinosa (L.) Cass. (Asteraceae), Flavour Fragr. J., 2003, 18, 3, 195-197, https://doi.org/10.1002/ffj.1180 . [all data]

Stashenko, Jaramillo, et al., 2003
Stashenko, E.E.; Jaramillo, B.E.; Martínez, J.R., Comparación de la composición química y de la actividad antioxidante in vitro de los metabolitos secundarios volátiles de plantas de la familia verbenaceae, Rev. Acad. Colomb. Cienc. Exactas Fis. Nat., 2003, 27, 105, 579-597. [all data]

Jirovetz, Buchbauer, et al., 2002
Jirovetz, L.; Buchbauer, G.; Ngassoum, M.B.; Geissler, M., Aroma compound analysis of Piper nigrum and Piper guineense essential oils from Cameroon using solid-phase microextraction-gas chromatography, solid-phase microextraction-gas chromatography-mass spectrometry and olfactometry, J. Chromatogr. A, 2002, 976, 1-2, 265-275, https://doi.org/10.1016/S0021-9673(02)00376-X . [all data]

Jirovetz, Ngassoum, et al., 2002
Jirovetz, L.; Ngassoum, M.B.; Geissler, M., Analysis of the headspace aroma compounds of the seeds of the Cameroonian garlic plant Hua gabonii using SPME/GC/FID, SPME/GC/MS and olfactometry, Eur. Food Res. Technol., 2002, 214, 3, 212-215, https://doi.org/10.1007/s00217-001-0481-y . [all data]

Khallouki, Younos, et al., 2002
Khallouki, F.; Younos, C.; Soulimani, R.; Bessière, J.M., Chemical composition of the essential oils of Annona cuneata L. and Annona senegalensis Pers. stem barks, Flavour Fragr. J., 2002, 17, 5, 398-400, https://doi.org/10.1002/ffj.1115 . [all data]

Kobaisy, Tellez, et al., 2002
Kobaisy, M.; Tellez, M.R.; Dayan, F.E.; Duke, S.O., Phytotoxicity and volatile constituents from leaves of Callicarpa japonica Thunb., Phytochemistry, 2002, 61, 1, 37-40, https://doi.org/10.1016/S0031-9422(02)00207-8 . [all data]

Kuiate, Bessière, et al., 2002
Kuiate, J.-R.; Bessière, J.-M.; Zollo, P.-H.A., Composition of the essential oils from three Laggera Spp. from Cameroon, Flavour Fragr. J., 2002, 17, 2, 105-108, https://doi.org/10.1002/ffj.1057 . [all data]

Limberger, Simões-Pires, et al., 2002
Limberger, R.P.; Simões-Pires, C.; Sobral, M.; Menu, C.; Bessiere, J.-M.; Henriques, A.T., Essential oils from some Myrceugenia species (Myrtaceae), Flavour Fragr. J., 2002, 17, 5, 341-344, https://doi.org/10.1002/ffj.1113 . [all data]

Lockwood, Asghari, et al., 2002
Lockwood, G.B.; Asghari, G.; Hakimi, B., Production of essential oil constituents by cultured cells of Carum copticum L., Flavour Fragr. J., 2002, 17, 6, 456-458, https://doi.org/10.1002/ffj.1129 . [all data]

Norouzi-Arasi, Yavari, et al., 2002
Norouzi-Arasi, H.; Yavari, I.; Ghaffarzadeh, F.; Mortazavi, M.-S., Volatile constituents of Cymbopogon olivieri (Boiss.) Bor from Iran, Flavour Fragr. J., 2002, 17, 4, 272-274, https://doi.org/10.1002/ffj.1096 . [all data]

Sefidkon, Dabiri, et al., 2002
Sefidkon, F.; Dabiri, M.; Alamshahi, A., Analysis of the essential oil of Nepeta fissa C.A. Mey from Iran, Flavour Fragr. J., 2002, 17, 2, 89-90, https://doi.org/10.1002/ffj.1045 . [all data]

Velasco-Negueruela, Pérez-Alonso, et al., 2002
Velasco-Negueruela, A.; Pérez-Alonso, M.J.; Palá-Paúl, J.; Íñigo, A.; López, G., Leaf essential oils analysis of Juniperus navicularis Gandoger, Botanica Complutensis, 2002, 26, 85-91. [all data]

Bailac, Dellacasa, et al., 2001
Bailac, P.N.; Dellacasa, A.D.; Bernasconi, H.O.; Ponzi, M.I.; Firpo, N.H., Essential oil of female plants of Baccharis coridifolia De Candole, J. Essent. Oil Res., 2001, 13, 1, 23-24, https://doi.org/10.1080/10412905.2001.9699593 . [all data]

Jirovetz L., Buchbauer G., et al., 2001
Jirovetz L.; Buchbauer G.; Shafi P.M.; Rosamma M.K.; Geissler M., Analysis of the composition and aroma of the essential leaf oil of Syzygium travancoricum from South India by GC-FID, GC-MS, and olfactometry. Seasonal changes of composition, Chromatographia Sup., 2001, 53, S1, s372-s374, https://doi.org/10.1007/BF02490359 . [all data]

Rousis, Papadogianni, et al., 2001
Rousis, V.; Papadogianni, K.; Vagias, C.; Harvala, C.; Petrakis, P.V.; Ortiz, A., Volatile constituents of three Pinus species grown in Greece, J. Essent. Oil Res., 2001, 13, 2, 118-121, https://doi.org/10.1080/10412905.2001.9699632 . [all data]

Santos, Moreira, et al., 2001
Santos, P.R.; Moreira, D.L.; Guimaraes, E.F.; Kaplan, M.A.C., Essential oil analysis of 10 piperaceae species from the Brazilian Atlantic forest, Phytochemistry, 2001, 58, 4, 547-551, https://doi.org/10.1016/S0031-9422(01)00290-4 . [all data]

Yang, 2001
Yang, R., Analysis of the volatile components in peel oil of Yuzu by gas chromatography/mass spectrometry, Chin. J. Anal. Chem., 2001, 29, 3, 313-316. [all data]

Yang, 2001, 2
Yang, R., Volatile compounds in peel oil of Citrus sudachi, Food Sci. (Beijing), 2001, 22, 3, 71-73. [all data]

Mallavarapu, Rao, et al., 2000
Mallavarapu, G.R.; Rao, L.; Ramesh, S., Volatile constituents of the leaf and fruit oils of Murraya koenigii Spreng., L. Ess. Oil Res., 2000, 12, 6, 766-768, https://doi.org/10.1080/10412905.2000.9712211 . [all data]

Ayedoun, Adéoti, et al., 1999
Ayedoun, M.A.; Adéoti, B.S.; Setondji, J.; Tchoumbougnang, F.; Kuiaté, J.R.; Zollo, P.H.A.; Menut, C.; Lamaty, G.; Bessière, J.M., Aromatic plants of tropical West Africa. XII. Essential oil of Hoslundia opposita Vahl. growing in Benin and Cameroon, Flavour Fragr. J., 1999, 14, 5, 319-321, https://doi.org/10.1002/(SICI)1099-1026(199909/10)14:5<319::AID-FFJ836>3.0.CO;2-O . [all data]

Menon, Chacko, et al., 1999
Menon, A.N.; Chacko, S.; Narayanan, C.S., Free and glycosidically bound volatiles of cardamom (Eletteria cardamomum Maton var. miniscula Burkill), Flavour Fragr. J., 1999, 14, 1, 65-68, https://doi.org/10.1002/(SICI)1099-1026(199901/02)14:1<65::AID-FFJ789>3.0.CO;2-A . [all data]

Zoghbi, Andrade, et al., 1999
Zoghbi, M.G.B.; Andrade, E.H.A.; Maia, J.G.S., Volatile constituents from leaves and flowers of Alpinia speciosa K. Schum. and A. purpurata (Viell.) Schum., Flavour Fragr. J., 1999, 14, 6, 411-414, https://doi.org/10.1002/(SICI)1099-1026(199911/12)14:6<411::AID-FFJ854>3.0.CO;2-U . [all data]

Doneanu and Anitescu, 1998
Doneanu, C.; Anitescu, G., Supercritical carbon dioxide extraction of Angelica archangelica L. root oil, J. Supercrit. Fluids, 1998, 12, 1, 59-67, https://doi.org/10.1016/S0896-8446(97)00040-5 . [all data]

Kökdil, Kurucu, et al., 1998
Kökdil, G.; Kurucu, S.; Yildiz, A., Essential oil composition of Nepeta nuda L. ssp. nuda, Flavour Fragr. J., 1998, 13, 4, 233-234, https://doi.org/10.1002/(SICI)1099-1026(1998070)13:4<233::AID-FFJ730>3.0.CO;2-7 . [all data]

Poiana, Sicari, et al., 1998
Poiana, M.; Sicari, V.; Mincione, B., Supercritical carbon dioxide (SC-CO2) extraction of grapefruit flavedo, Flavour Fragr. J., 1998, 13, 2, 125-130, https://doi.org/10.1002/(SICI)1099-1026(199803/04)13:2<125::AID-FFJ708>3.0.CO;2-# . [all data]

Santos, Andrade, et al., 1998
Santos, A.S.; Andrade, E.H.A.; Zoghbi, M. das.G.B.; Luz, A.I.R.; Maia, J.G.S., Sesquiterpenes of Amazonian Piper species, Acta Amazomica, 1998, 28, 2, 127-130. [all data]

Stashenko, Cervantes, et al., 1998
Stashenko, E.E.; Cervantes, M.; Combariza, Y.; Martínez, J.R., HRGC-FID-MSD Analysis of the Secondary Metabolites Obtained by Different Extraction Methods from Lepechinia schiedeana, and Evaluation of its Antioxidant Activity in vitro in 20th International Symposium on Capillary Chromatography, 1998, 1-11. [all data]

Tellez, Estell, et al., 1997
Tellez, M.R.; Estell, R.E.; Frederickson, E.L.; Havstad, K.M., Essntial oil of Flourensia cernua DC, J. Essent. Oil Res., 1997, 9, 6, 619-624, https://doi.org/10.1080/10412905.1997.9700799 . [all data]

Ayedoun, Adeoti, et al., 1996
Ayedoun, A.M.; Adeoti, B.S.; Sossou, P.V.; Leclerq, P.A., Influence of fruit conservation methods on the essential oil composition of xylopia aethiopica (Dunal) A. Richard from Benin, Flavour Fragr. J., 1996, 11, 4, 245-250, https://doi.org/10.1002/(SICI)1099-1026(199607)11:4<245::AID-FFJ583>3.0.CO;2-K . [all data]

Chacko, Jayalekshmy, et al., 1996
Chacko, S.; Jayalekshmy, A.; Gopalakrishnan, M.; Narayanan, C.S., Roasting studies on black pepper (Piper nigrum L.), Flavour Fragr. J., 1996, 11, 5, 305-310, https://doi.org/10.1002/(SICI)1099-1026(199609)11:5<305::AID-FFJ588>3.0.CO;2-1 . [all data]

Gawdzik, Mardarowicz, et al., 1996
Gawdzik, J.; Mardarowicz, M.; Suprynowicz, Z.; Kawka, S.; Wolski, T., Supercritical fluid extraction of essential oils from the fruits of Archangelica off. Hoffm. and their characterization by GC/MS, J. Hi. Res. Chromatogr., 1996, 19, 4, 237-240, https://doi.org/10.1002/jhrc.1240190416 . [all data]

Rajeswara, Kaul, et al., 1996
Rajeswara, B.R.; Kaul, P.N.; Bhattacharya, A.K.; Mallavarapu, G.R.; Ramesh, S., Yield and chemical composition of the essential oils of three Cymbopogon species suffering from iron chlorosis, Flavour Fragr. J., 1996, 11, 5, 289-293, https://doi.org/10.1002/(SICI)1099-1026(199609)11:5<289::AID-FFJ590>3.0.CO;2-7 . [all data]

Gopalakrishnan, Menon, et al., 1993
Gopalakrishnan, M.; Menon, N.; Padmakumari, K.P.; Jayalekshmy, A.; Narayanan, C.S., GC Analysis and Odor Profiles of Four New Indian Genotypes of Piper nigrum L., J. Essent. Oil Res., 1993, 5, 3, 247-253, https://doi.org/10.1080/10412905.1993.9698217 . [all data]

Tamura, Yang, et al., 1993
Tamura, H.; Yang, R.-H.; Sugisawa, H., Aroma profiles of peel oils of acid citrus, ACS Sym. Ser., 1993, 525, 121-136. [all data]

Ronse and De Pooter, 1990
Ronse, A.C.; De Pooter, H.L., Essential Oil Production by Belgian Artemisia alba (Turra) before and after Micropropagation, J. Essent. Oil Res., 1990, 2, 5, 237-242, https://doi.org/10.1080/10412905.1990.9697873 . [all data]

Sugisawa, Yamamoto, et al., 1989
Sugisawa, H.; Yamamoto, M.; Tamura, H.; Takagi, N., The comparison of volatile components in peel oil from four species of navel orange, Nippon Shokuhin Kogio Gakkaishi, 1989, 36, 6, 455-462, https://doi.org/10.3136/nskkk1962.36.6_455 . [all data]

Sugisawa, Yang, et al., 1989
Sugisawa, H.; Yang, R.H.; Kawabata, C.; Tamura, H., Volatile constituents in the peel oil of sudachi (Citrus sudachi), Agric. Biol. Chem., 1989, 53, 6, 1721-1723, https://doi.org/10.1271/bbb1961.53.1721 . [all data]

Albano, Lima, et al., 2012
Albano, S.M.; Lima, A.S.; Miguel, M.G.; Pedro, L.G.; Barroso, J.G.; Figueiredo, A.C., Antioxidant, anti-5-lipoxygenase and antiacetylcholinesterase activities of essential oils and decoction water of some aromatic plants, Rec. Nat. Prod., 2012, 6, 1, 35-48. [all data]

da Silva, de Souza, et al., 2012
da Silva, A.C.; de Souza, P.E.; Machado, J. daC.; da Silva, B.M.; Pinto, J.E.B.P., Effectiveness of essential oils in the treatment of Colletotrichum truncatum-infected soybean seeds, Tropical Plant Patology, 2012, 37, 5, 305-313, https://doi.org/10.1590/S1982-56762012000500001 . [all data]

Chaverri, Diaz, et al., 2011
Chaverri, C.; Diaz, C.; Cicco, J.F., Chemical analysis of essential oils from Ocotea gomezii W.C. Burger and Ocotea morae Gomez-Laur. (Lauraceae) collected at Reserva biologica Alberto M. Brenes in Costa Rica and their cytotoxic activity on Tumor cell lines, J. Braz. Chem. Soc., 2011, 22, 4, s1-s4, https://doi.org/10.1590/S0103-50532011000400018 . [all data]

Chen and Li, 2011
Chen, S.; Li, X., Analysis of common volatile constituents between herbal pair Ephedra Sinica Stapf-Zingiber offoconale Rosc. and its single herb by GC-MS combined with AMWFA method, 2011, retrieved from http://www.webmedcentral.com. [all data]

Fortes, Naves, et al., 2011
Fortes, G.A.C.; Naves, S.S.; Godoi, F.F.F.; Duarte, A.R.; Ferri, P.H.; Santos, S.C., Assessment of a maturity index in Jabuticaba fruit by the evaluation of phenolic compounds, essential oil components, sugar content and total acidity, Amer. J. Food Technol., 2011, 6, 11, 974-984, https://doi.org/10.3923/ajft.2011.974.984 . [all data]

Lima, Quintans-Junior, et al., 2011
Lima, G.M.; Quintans-Junior, L.J.; Thomazzi, S.M.; Almeida, E.M.S.A.; Melo, M.S.; Serafini, M.R.; Cavalcanti, S.C.H.; Gelain, D.P.; Santos, J.P.A.; Blank, A.F.; Alves, P.B.; Neta, P.M.O.; Lima, J.T.; Rocha, R.F.; Moreira, J.C.F.; Araujo, A.A.S., Phytochemical screening, antinociceptive and anti-inflammatory activities of Chrysopogon zizanioides essential oil, Braz. J. Pharmacognosy, 2011, 1-8. [all data]

Payo, Colo, et al., 2011
Payo, D.A.; Colo, J.; Calumpong, H.; de Clerck, O., Variability of non-polar secondary metabolites in the Red Alga Portieria, Mar Drugs, 2011, 9, 11, 2438-2468, https://doi.org/10.3390/md9112438 . [all data]

Bamoniri, Mirjalili, et al., 2010
Bamoniri, A.; Mirjalili, B.B.F.; Mazoochi, A.; Naeimi, H.; Golchin, H.; Batooli, H., Study of the bioactive and fragrant constituents extracted from leaves and aerial parts of Haplophyllum glabrrimum Bge ex Bioss from Central Iran by nano scale injection, Digest J. of Nanomaterial and Biostructures, 2010, 5, 1, 169-172. [all data]

Kapoor, Singh, et al., 2009
Kapoor, I.; Singh, B.; Singh, G.; De Heluani, C.S.; De Lampasona, M.P.; Catalan, C.A.N., Chemistry and in vitro antioxidant activity of volatile oil and oleoresins of black pepper (Piper nigrum), J. Agric. Food Chem., 2009, 57, 12, 5358-5364, https://doi.org/10.1021/jf900642x . [all data]

Riahi, Pourbasheer, et al., 2009
Riahi, S.; Pourbasheer, E.; Ganjali, M.R.; Norouzi, P., Investigation of different linear and non-linear chemometric methods for modeling of retention index of essential oil components: Concerns to support vector mashine, J. Hazard. Mat., 2009, 166, 2-3, 853-859, https://doi.org/10.1016/j.jhazmat.2008.11.097 . [all data]

Kristiawan, Sobolik, et al., 2008
Kristiawan, M.; Sobolik, V.; Al-Haddad, M.; Allaf, K., Effect of pressure-drop rate on the isolation of cananga oil using instantaneous controlled pressure-drop process, Chem. Eng. Processing, 2008, 47, 1, 66-75, https://doi.org/10.1016/j.cep.2007.08.011 . [all data]

Zachariah, Leela, et al., 2008
Zachariah, T.J.; Leela, N.K.; Maya, K.M.; Rema, J.; Mathew, P.A.; Vipin, T.M.; Krishnamoorthy, B., Chemical composition of leaf oils of Myristica beddomeii (King), Myristica fragrans (Houtt.) and Myristica malabarica (Lamk.), J. Spices Arom. Crops, 2008, 17, 1, 10-15. [all data]

Cole, Haber, et al., 2007
Cole, R.A.; Haber, W.A.; Setzer, W.N., Chemical composition of essential oils of seven species of Eugenia from Monteverde, Costa Rica, Biochem. Syst. Ecol., 2007, 35, 12, 877-886, https://doi.org/10.1016/j.bse.2007.06.013 . [all data]

Merle, Verdeguer, et al., 2007
Merle, H.; Verdeguer, M.; Blázquez, M.A.; Boira, H., Chemical composition of the essential oils from Eriocephalus africanus L. var. africanus populations growing in Spain, Flavour Fragr. J., 2007, 22, 6, 461-464, https://doi.org/10.1002/ffj.1821 . [all data]

Nivinsliene, Butkiene, et al., 2007
Nivinsliene, O.; Butkiene, R.; Gudalevic, A.; Mockute, D.; Meskauskiene, V.; Grigaliunaite, B., Influence of urban environment on chemical composition of Tilia cordata essential oil, Chemija, 2007, 18, 1, 44-49. [all data]

Radusiene, Judzentiene, et al., 2007
Radusiene, J.; Judzentiene, A.; Peciulyte, D.; Janulis, V., Essential Oil Composition and Antimicrobial Assay of Acorus calamus Leaves from Different Wild Populations, Plant Genetic Resources: Characterization and Utilization, 2007, 5, 1, 37-44, https://doi.org/10.1017/S1479262107390928 . [all data]

Setzer, Stokes, et al., 2007
Setzer, W.N.; Stokes, S.L.; Penton, A.F.; Takaku, S.; Haber, W.A.; Hansell, E.; Caffrey, C.R.; McKerrow, J.H., Cruzain inhibitory activity of leaf essential oils of neotropical Lauraceae and essential oil components, Natural Product Communications, 2007, 2, 12, 1203-1210. [all data]

Stokes, Cole, et al., 2007
Stokes, S.L.; Cole, R.A.; Rangelova, M.P.; Haber, W.A.; Setzer, W.N., Cruzain inhibitory activity of the leaf essential oil from an undescribed species of Eugenia from Monteverde, Costa Rica, Natural Product Communications, 2007, 2, 12, 1211-1213. [all data]

Takaku, Haber, et al., 2007
Takaku, S.; Haber, W.A.; Setzer, W.N., Leaf essential oil composition of 10 species of Ocotea (Lauraceae) from Monteverde, Costa Rica, Biochem. Syst. Ecol., 2007, 35, 8, 525-532, https://doi.org/10.1016/j.bse.2007.02.003 . [all data]

Werka, Boehme, et al., 2007
Werka, J.S.; Boehme, A.K.; Setzer, W.N., Biological activities of essential oils from Monteverde, Costa Rica, Natural Product Communications, 2007, 2, 12, 1215-1219. [all data]

Kawaree, Phutdhawong, et al., 2006
Kawaree, R.; Phutdhawong, W.; Picha, P.; Ngamkham, J., Chemical compounds, anticancer and antioxidant activities of volatile oil from Piper sarmentosum Roxb., Polyscias fruticosa Harms. and Polygonum odoratum Lour., KMITI Sci. J., 2006, 6, 2b, 499-504. [all data]

Massardo, Senatore, et al., 2006
Massardo, D.R.; Senatore, F.; Alifano, P.; del Giudice, L.; Pontieri, P., Vetiver oil production correlates with early root growth, Biochem. Syst. Ecol., 2006, 34, 5, 376-382, https://doi.org/10.1016/j.bse.2005.10.016 . [all data]

Schmidt, Noletto, et al., 2006
Schmidt, J.M.; Noletto, J.A.; Vogler, B.; Setzer, W.N., Abaco Bush Medicine: Chemical composition of the essential oils of four aromatic medicinal plants from Abaco Island, Bahamas, J. Herbs, Spices Medicinal Plants, 2006, 12, 3, 43-65, https://doi.org/10.1300/J044v12n03_04 . [all data]

Singh G., Maurya S., et al., 2006
Singh G.; Maurya S.; de Lampasona M.P.; Catalan C.A.N., Studies on essential oils, Part 41. Chemical composition, antifungal, antioxidant and sprout suppressant activities of coriander (Coriandrum sativum) essential oil and its oleoresin, Flavour Fragr. J., 2006, 21, 3, 472-479, https://doi.org/10.1002/ffj.1608 . [all data]

Tognolini, Barocelli, et al., 2006
Tognolini, M.; Barocelli, E.; Ballabeni, V.; Bruni, R.; Bianchi, A.; Chiavarini, M.; Impicciatore, M., Comparative screening of plant essential oils: Phenylpropanoid moiety as basic core for antiplatelet activity, Life Sciences, 2006, 78, 13, 1419-1432, https://doi.org/10.1016/j.lfs.2005.07.020 . [all data]

Butkienë, Nivinskienë, et al., 2005
Butkienë, R.; Nivinskienë, O.; Mockutë, D., α-Pinene chemotype of leaf (needle) essential oils of Juniperus communis L. growing wild in Vilnius district, Chemija, 2005, 16, 1, 53-60. [all data]

Cysne, Canuto, et al., 2005
Cysne, J.B.; Canuto, K.M.; Pessoa, O.D.L.; Nunes, E.P.; Silveira, E.R., Leaf essential oils of four Piper species from the State of Ceará - Northeast of Brazil, J. Braz. Chem. Soc., 2005, 16, 6B, 1378-1381, https://doi.org/10.1590/S0103-50532005000800012 . [all data]

Faleio, Miguel, et al., 2005
Faleio, L.; Miguel, G.; Gomes, S.; Costa, L.; Venancio, F.; Teixeira, A.; Figueiredo, A.C.; Barroso, J.G.; Pedro, L.G., Antibacterial and Antioxidant Activities of Essential Oils Isolated from Thymbra capitata L. (Cav.) and Origanum vulgare L., J. Agric. Food Chem., 2005, 53, 21, 8162-8168, https://doi.org/10.1021/jf0510079 . [all data]

Nivinskienë, Butkienë, et al., 2005
Nivinskienë, O.; Butkienë, R.; Mockutë, D., Chemical composition of seed (fruit) essential oils of Angelica archangelica L. growing wild in Lithuania, Chemija, 2005, 16, 3-4, 51-54. [all data]

Radudienë, Judpintienë, et al., 2005
Radudienë, J.; Judpintienë, A.; Peèiulytë, D.; Janulis, V., Chemical composition of essential oil and antimicrobial activity of Origanum vulgare, Biologija, 2005, 4, 53-58. [all data]

Singh, Maurya, et al., 2005
Singh, G.; Maurya, S.; Catalan, C.; de Lampasona, M.P., Studies on essential oils, Part 42: chemical, antifungal, antioxidant and sprout suppressant studies on ginger essential oil and its oleoresin, Flavour Fragr. J., 2005, 20, 1, 1-6, https://doi.org/10.1002/ffj.1373 . [all data]

Barros-Filho, Nunes, et al., 2004
Barros-Filho, B.A.; Nunes, F.M.; de Oliveira, M.C.F.; Mafezoli, J.; Andrade-Neto, M.; Silveira, E.R.; Pirani, J.R., Volatile constituents from Esenbeckia almawillia (Rutaceae), Biochem. Syst. Ecol., 2004, 32, 9, 817-821, https://doi.org/10.1016/j.bse.2004.02.003 . [all data]

Butkienë, Nivinskienë, et al., 2004
Butkienë, R.; Nivinskienë, O.; Mockutë, D., Chemical composition of unripe and ripe berry essential oils of Juniperus communis L. growing wild in Vilnius district, Chemija, 2004, 15, 4, 57-63. [all data]

Couladis, Özcan, et al., 2004
Couladis, M.; Özcan, M.; Tzakou, O.; Akgül, A., Menengic (Pistacia terebinthus L.) agacinin degisik organlarinda ucucu yag bilesimi, Bitkisel Ilac Hammaddeleri Toplantisi, Bildiriler, 29-31 Mayis 2002, 2004, 6. [all data]

Hafez and Abdel-Salam, 2004
Hafez, S.S.; Abdel-Salam, H.A., chemical composition and antimicrobial activity of the volatile constituents of thuja occidentalis L. growing in Egipt, Alexandria J. Pharm. Sci., 2004, 18, 1, 41-47. [all data]

Koba, Sanda, et al., 2004
Koba, K.; Sanda, K.; Raynaud, C.; Nenonene, Y.A.; Millet, J.; Chaumont, J.P., Activités antimicrobiennes d'huiles essentielles de trois Cymbopogon sp. africains vis-àvis de germes pathogènes d'animaux de compagnie, Ann. Med. Vet., 2004, 148, 202-206. [all data]

Miguel, Simões, et al., 2004
Miguel, G.; Simões, M.; Figueiredo, A.C.; Barroso, J.G.; Pedro, L.G.; Carvalho, L., Composition and antioxidant activities of the essential oils of Thymus caespititius, Thymus camphoratus and Thymus mastichina, Food Chem., 2004, 86, 2, 183-188, https://doi.org/10.1016/j.foodchem.2003.08.031 . [all data]

Tepe, Donmez, et al., 2004
Tepe, B.; Donmez, E.; Unlu, M.; Candan, F.; Daferera, D.; Vardar-Unlu, G.; Polissiou, M.; Sokmen, A., Antimicrobial and antioxidative activities of the essential oils and methanol extracts of Salvia cryptantha (Montbret et Aucher ex Benth.) and Salvia multicaulis (Vahl), Food Chem., 2004, 84, 4, 519-525, https://doi.org/10.1016/S0308-8146(03)00267-X . [all data]

Vinogradov, 2004
Vinogradov, B.A., Production, composition, properties and application of essential oils, 2004, retrieved from http://viness.narod.ru. [all data]

Faleiro, Miguel, et al., 2003
Faleiro, M.L.; Miguel, M.G.; Ladeiro, F.; Venancio, F.; Tavares, R.; Brito, J.C.; Figueiredo, A.C.; Barroso, J.G.; Pedro, L.G., Antimicrobial activity of essential oils isolated from Portuguese endemic species of Thymus, Lett. Appl. Microbiol., 2003, 36, 1, 35-40, https://doi.org/10.1046/j.1472-765X.2003.01259.x . [all data]

Bakshu and Raju, 2002
Bakshu, L.Md.; Raju, R.R.V., Essential oil composition and antimicrobial activity of tuberous roots of Pimpinella tirupatiensis Bal. Subr., an endemic taxon from eastern ghats, India, Flavour Fragr. J., 2002, 17, 6, 413-415, https://doi.org/10.1002/ffj.1118 . [all data]

Li, Wu, et al., 2002
Li, C.; Wu, H.; Yang, L.; ren, Y., Study of the composition of ginger oil from Laifeng, Flavour Fragr. Cosmetics, 2002, 5, 15-17. [all data]

Figueiredo, Miguel, et al., 2001
Figueiredo, A.C.; Miguel, M.G.; Duarte, A.M.F.; Barroso, J.G.; Pedro, L.G., Essential oil composition of Thymus lotocephallus G. López R. Morales, collected during flowering and vegetative phases, Flavour Fragr. J., 2001, 16, 6, 417-421, https://doi.org/10.1002/ffj.1028 . [all data]

Petrakis, Tsitsimpikou, et al., 2001
Petrakis, P.V.; Tsitsimpikou, C.; Tzakou, O.; Couladis, M.; Vagias, C.; Roussis, V., Needle volatiles from five Pinus species growing in Greece, Flavour Fragr. J., 2001, 16, 4, 249-252, https://doi.org/10.1002/ffj.990 . [all data]

da Silva, Figueiredo, et al., 1998
da Silva, J.A.; Figueiredo, A.C.; Barroso, J.G.; Pedro, L.G.; Gomes, M.A.; Fontinha, S.S.; Scheffer, J.J.C., Composition of the essential oil of Melanoselinum decipiens (Schrad. Wendl.) Hoffm., an endemic species of the Madeira and Azores archipelagos, Flavour Fragr. J., 1998, 13, 2, 90-92, https://doi.org/10.1002/(SICI)1099-1026(199803/04)13:2<90::AID-FFJ700>3.0.CO;2-D . [all data]

Zenkevich, 1997
Zenkevich, I.G., Analytical Parameters of Components of Essential Oils for their Chromatographic and Chromato-Spectral Identificaiton. Oxsigenated derivatives of Mono- and Sesquiterpene Hydrocarbons, Rastit, Resursy (Rus.), 1997, 33, 1, 16-28. [all data]

Singh, Kumar, et al., 2007
Singh, B.; Kumar, R.; Bhandari, S.; Pathania, S.; Lal, B., Volatile constituents of natural Boswellia serrata oleo-gum-resin and commercial samples, Flavour Fragr. J., 2007, 22, 2, 145-147, https://doi.org/10.1002/ffj.1772 . [all data]

Vichi, Riu-Aumatell, et al., 2007
Vichi, S.; Riu-Aumatell, M.; Mora-Pons, M.; Guadayol, J.M.; Buxaderas, S.; López-Tamames, E., Analytical, Nutritional and Clinical Methods. HS-SPME coupled to GC/MS for quality control of Juniperus communis L. berries used for gin aromatization, Food Chem., 2007, 105, 4, 1748-1754, https://doi.org/10.1016/j.foodchem.2007.03.026 . [all data]

Kitchlu, Bakshi, et al., 2006
Kitchlu, S.; Bakshi, S.K.; Kaul, M.K.; Bhan, M.K.; Thapa, R.K.; Agarwal, S.G., Tanacetum gracile Hook. f T. A new source of lavandulol from Ladakh Himalaya (India), Flavour Fragr. J., 2006, 21, 4, 690-692, https://doi.org/10.1002/ffj.1674 . [all data]

Ka, Choi, et al., 2005
Ka, M.-H.; Choi, E.H.; Chun, H.-S.; Lee, K.-G., Antioxidative Activity of Volatile Extracts Isolated from Angelica tenuissimae Roots, Peppermint Leaves, Pine Needles, and Sweet Flag Leaves, J. Agric. Food Chem., 2005, 53, 10, 4124-4129, https://doi.org/10.1021/jf047932x . [all data]

Lee, Umano, et al., 2005
Lee, S.-J.; Umano, K.; Shibamoto, T.; Lee, K.-G., Identification of volatile components in basil (Ocimum basilicum L.) and thyme leaves (Thymus vulgaris L.) and their antioxidant properties, Food Chem., 2005, 91, 1, 131-137, https://doi.org/10.1016/j.foodchem.2004.05.056 . [all data]

Njoroge, Koaze, et al., 2005, 2
Njoroge, S.M.; Koaze, H.; Mwaniki, M.; Minh Tu, N.T.; Sawamura, M., Essential oils of Kenyan Citrus fruits: volatile components of two varieties of mandarins (Citrus reticulata) and a tangelo (C. paradisi × C. tangerina), Flavour Fragr. J., 2005, 20, 1, 74-79, https://doi.org/10.1002/ffj.1376 . [all data]

Vichi, Riu-Aumatell, et al., 2005
Vichi, S.; Riu-Aumatell, M.; Mora-Pons, M.; Buxaderas, S.; Lopez-Tamames, E., Characterization of Volatiles in Different Dry Gins, J. Agric. Food Chem., 2005, 53, 26, 10154-10160, https://doi.org/10.1021/jf058121b . [all data]

Choi, 2004, 2
Choi, H.-S., Aroma evaluation of an aquatic herb, changpo (Acorus calamus Var. angustatus Bess), by AEDA and SPME, J. Agric. Food Chem., 2004, 52, 26, 8099-8104, https://doi.org/10.1021/jf040239p . [all data]

Jiang and Kubota, 2004
Jiang, L.; Kubota, K., Differences in the volatile components and their odor characteristics of green and ripe fruits and dried pericarp of Japanese pepper (Xanthoxylum piperitum DC.), J. Agric. Food Chem., 2004, 52, 13, 4197-4203, https://doi.org/10.1021/jf030663a . [all data]

Umano, Hagi, et al., 2002
Umano, K.; Hagi, Y.; Shibamoto, T., Volatile chemicals identified in extracts from newly hybrid citrus, dekopon (Shiranuhi mandarin Suppl. J.), J. Agric. Food Chem., 2002, 50, 19, 5355-5359, https://doi.org/10.1021/jf0203951 . [all data]

Christoph, 2001
Christoph, F., Chemische Zuzammensetzung und antimikrobielle Eigenschaften der ätherischen Öle von Leptospermum scoparium J. R. et G. Forst. und anderer Teebaumöle der Gattungen Kunzea, Leptospermum und Melaleuca unter besonderer Berücksichtigung von Handelsölen, Dissertation, University of Hamburg, Germany, 2001, 196. [all data]

Chagonda, Makanda, et al., 2000, 2
Chagonda, L.S.; Makanda, C.; Chalchat, J.-C., The essential oils of wild and cultivated Cymbopogon validus (Stapf) Stapf ex Burtt Davy and Elionurus muticus (Spreng.) Kunth from Zimbabwe, Flavour Fragr. J., 2000, 15, 2, 100-104, https://doi.org/10.1002/(SICI)1099-1026(200003/04)15:2<100::AID-FFJ874>3.0.CO;2-Y . [all data]

Onocha, Ekundayo, et al., 1999
Onocha, P.A.; Ekundayo, O.; Oyelola, O.; Laakso, I., Essential oils of Dacryodes edulis (G. Don) H. J. Lam (African pear), Flavour Fragr. J., 1999, 14, 2, 135-139, https://doi.org/10.1002/(SICI)1099-1026(199903/04)14:2<135::AID-FFJ788>3.0.CO;2-L . [all data]

Bignell, Dunlop, et al., 1997
Bignell, C.M.; Dunlop, P.J.; Brophy, J.J., Volatile leaf oils of some south-western and southern Australian speices of the genus Eucalyptus (Series I). Part XVIII. A. Subgenus monocalyptus. B. Subgenus Symphyomyrtus: (i) section Guilfoyleanae; (ii) section bisectaria, series accedentes, series occidentales, series levispermae, series loxophlebae, series macrocarpae, series orbifoliae, series calycogonae; (iii) section dumaria, series incrassatae and series ovulares, Flavour Fragr. J., 1997, 12, 423-432. [all data]

Chyau, Chen, et al., 1992
Chyau, C.-C.; Chen, S.-Y.; Wu, C.-M., Differences of volatile and nonvolatile constituents between mature and ripe guave (Psidium guajava Linn) fruits, J. Agric. Food Chem., 1992, 40, 5, 846-849, https://doi.org/10.1021/jf00017a028 . [all data]

van Beek, Kleis, et al., 1989
van Beek, T.A.; Kleis, R.; Posthumus, M.A.; van Veldhuizen, A., Essential oil of Amyris balsamifera, Phytochemistry, 1989, 28, 7, 1909-1911, https://doi.org/10.1016/S0031-9422(00)97885-3 . [all data]

Tabanca N., Demirci B., et al., 2007
Tabanca N.; Demirci B.; Baser K.H.C.; Mincsovics E.; Khan S.I.; Jacob M.R.; Wedge D.E., Characterization of volatile constituents of Scaligeria tripartita and studies on the antifungal activity against phytopathogenic fungi, J. Chromatogr. B, 2007, 850, 1-2, 221-229, https://doi.org/10.1016/j.jchromb.2006.11.041 . [all data]

Tabanca N., Demirci B., et al., 2007, 2
Tabanca N.; Demirci B.; Crockett S.L.; Baser K.H.C.; Wedge D.E., Chemical composition and antifungal activity of Arnica longifolia, Aster hesperius, and Chrysothamnus nauseosus essential oils, J. Agric. Food Chem., 2007, 55, 21, 8430-8435, https://doi.org/10.1021/jf071379c . [all data]

Suleimenov Y.M., Atazhanova G.A., et al., 2006
Suleimenov Y.M.; Atazhanova G.A.; Ozek T.; Demirci B.; Kulyyasov A.T.; Adekenov S.M.; Baser K.H.C., Essential oil composition of three species of Achillea from Kazakhstan, Chem. Nat. Compd. (Engl. Transl.), 2006, 37, 5, 447-450, https://doi.org/10.1023/A:1014471326724 . [all data]

Tabanca, Demirci, et al., 2005
Tabanca, N.; Demirci, B.; Kirimer, N.; Baser, K.H.C.; Bedir, E.; Khand, I.A.; Wedge, D.E., Gas chromatographic-mass spectrometric analysis of essential oils from Pimpinella aurea, Pimpinella corymbosa, Pimpinella peregrina and Pimpinella puberula gathered from Eastern and Southern Turkey, J. Chromatogr. A, 2005, 1097, 1-2, 192-198, https://doi.org/10.1016/j.chroma.2005.10.047 . [all data]

Kivcak, Akay, et al., 2004
Kivcak, B.; Akay, S.; Demirci, B.; Baser, K.H.C., Chemical composition of essential oils from leaves and twigs of Pistacia lentiscus, Pistacia lentiscus var. chia, and Pistacia terebinthus from Turkey, Pharm. Biol, 2004, 42, 4-5, 360-366, https://doi.org/10.1080/13880200490519677 . [all data]

Baser, Demirci, et al., 2003
Baser, K.H.C.; Demirci, B.; Dekebo, A.; Dagne, E., Essential oils of some Boswellia spp., myrrh and opopanax, Flavour Fragr. J., 2003, 18, 2, 153-156, https://doi.org/10.1002/ffj.1166 . [all data]

Demirci, Baser, et al., 2003
Demirci, B.; Baser, K.H.C.; Yildiz, B.; Bahcecioglu, Z., Composition of the essential oils of six endemic Salvia spp. from Turkey, Flavour Fragr. J., 2003, 18, 2, 116-121, https://doi.org/10.1002/ffj.1173 . [all data]

Baser, Demirei, et al., 2002
Baser, K.H.C.; Demirei, B.; Özek, T.; Akalin, E.; Özhatay, N., Micro-distilled volatile compounds from Ferulago species growing in Western Turkey, Pharm. Biol., 2002, 40, 6, 466-471, https://doi.org/10.1076/phbi.40.6.466.8439 . [all data]

Demirci, Baser, et al., 2002
Demirci, B.; Baser, K.H.C.; Tümen, G., Composition of the essential oil of Salvia aramiensis Rech. fil. growing in Turkey, Flavour Fragr. J., 2002, 17, 1, 23-25, https://doi.org/10.1002/ffj.1027 . [all data]

Tunalier, Kirimer, et al., 2002
Tunalier, Z.; Kirimer, N.; Baser, K.H.C., The composition of essential oils from various parts of Juniperus foetidissima, Chem. Nat. Compd. (Engl. Transl.), 2002, 38, 1, 43-47, https://doi.org/10.1023/A:1015725630556 . [all data]

Baser, Demirci, et al., 2001
Baser, K.H.C.; Demirci, B.; Tabanca, N.; Özek, T.; Gören, N., Composition of the essential oils of Tanacetum armenum (DC.) Schultz Bip., T. balsamita L., T. chiliophyllum (Fisch. Mey.) Schultz Bip. var. chiliophyllum and T. haradjani (Rech. fil.) Grierson and the enantiomeric distribution of camphor and carvone, Flavour Fragr. J., 2001, 16, 3, 195-200, https://doi.org/10.1002/ffj.977 . [all data]

Kaya, Demirci, et al., 2001
Kaya, A.; Demirci, B.; Baser, K.H.C., The composition of the essential oil of Stachys iberica subsp. stenostachya growing in Turkey, Chem. Nat. Compd. (Engl. Transl.), 2001, 37, 4, 326-328, https://doi.org/10.1023/A:1013762200024 . [all data]

Baser, Özek, et al., 2000
Baser, K.H.C.; Özek, T.; Demirci, B.; Duman, H., Composition of the essential oil of Prangos heyniae H. Duman et M. F. Watson, a new endemic from Turkey, Flavour Fragr. J., 2000, 15, 1, 47-49, https://doi.org/10.1002/(SICI)1099-1026(200001/02)15:1<47::AID-FFJ869>3.0.CO;2-9 . [all data]

Kirimer, Tabanca, et al., 2000
Kirimer, N.; Tabanca, N.; Özek, T.; Tümen, G.; Baser, K.H.C., Essential oils of annual Sideritis species growing in Turkey, Pharm. Biol., 2000, 38, 2, 106-111, https://doi.org/10.1076/1388-0209(200004)3821-1FT106 . [all data]

Baser, Kürkcüoglu, et al., 1998
Baser, K.H.C.; Kürkcüoglu, M.; Aytac, Z., Composition of the essential oil of Salvia euphratica Montbret ex Bentham var. euphratica from Turkey, Flavour Fragr. J., 1998, 13, 1, 63-64, https://doi.org/10.1002/(SICI)1099-1026(199801/02)13:1<63::AID-FFJ694>3.0.CO;2-Z . [all data]

Castioni and Kapetanidis, 1996
Castioni, P.; Kapetanidis, I., Volatile constituents from Brunfelsia grandiflora ssp. grandiflora: qualitative analysis by GC-MS, Scientia Pharmaceutica, 1996, 64, 83-91. [all data]

Kerrola and Kallio, 1994
Kerrola, K.M.; Kallio, H.P., Extraction of volatile compounds of angelica (Angelica archangelica L.) root by liquid carbon dioxide, J. Agric. Food Chem., 1994, 42, 10, 2235-2245, https://doi.org/10.1021/jf00046a030 . [all data]