Pentyl octanoate

Normal alkane RI, non-polar column, temperature ramp

Data compiled by: NIST Mass Spectrometry Data Center, William E. Wallace, director

Column type CapillaryCapillary
Active phase HP-5 MSSLB-5 MS
Column length (m) 30.30.
Carrier gas HeliumHelium
Substrate
Column diameter (mm) 0.320.25
Phase thickness (μm) 0.250.25
Tstart (C) 50.50.
Tend (C) 240.250.
Heat rate (K/min) 4.3.
Initial hold (min) 2.2.
Final hold (min) 10.10.
I 1490.1446.
ReferencePino, Marquez, et al., 2010Lo Presti, Sciarrone, et al., 2008
Comment MSDC-RI MSDC-RI

Normal alkane RI, polar column, custom temperature program

Data compiled by: NIST Mass Spectrometry Data Center, William E. Wallace, director

Column type Capillary
Active phase Carbowax 20M
Column length (m)
Carrier gas
Substrate
Column diameter (mm)
Phase thickness (μm)
Program not specified
I 1700.
ReferenceVinogradov, 2004
Comment MSDC-RI

References

Pino, Marquez, et al., 2010
Pino, J.A.; Marquez, E.; Quijano, C.E.; Castro, D., Volatile compounds in noni (Morinda citrifolia L.) at two ripening stages, Ciencia e Technologia de Alimentos, 2010, 30, 1, 183-187, https://doi.org/10.1590/S0101-20612010000100028 . [all data]

Lo Presti, Sciarrone, et al., 2008
Lo Presti, M.; Sciarrone, D.; Crupi, M.C.; Costa, R.; Ragusa, S.; Dugo, G.; Mondello, L., Evaliation of the volatile and chiral composition in Pistacia lentiscus L. essential oil, Flavour Fragr. J., 2008, 23, 4, 249-257, https://doi.org/10.1002/ffj.1878 . [all data]