5,6-Dihydro-2,4,6-trimethyl-4H-1,3,5-dithiazine

Van Den Dool and Kratz RI, polar column, temperature ramp

Data compiled by: NIST Mass Spectrometry Data Center, William E. Wallace, director

Column type CapillaryCapillaryCapillary
Active phase CP-Wax 52CBSupelcowax-10DB-Wax
Column length (m) 50.60.60.
Carrier gas H2HeHe
Substrate
Column diameter (mm) 0.320.250.25
Phase thickness (μm)  0.25
Tstart (C) 50.35.60.
Tend (C) 200.195.220.
Heat rate (K/min) 2.2.3.
Initial hold (min)  5.4.
Final hold (min)  90.30.
I 1756.1765.1750.
ReferenceLiu, Yang, et al., 2001Chung, 1999Chung, Eiserich, et al., 1994
Comment MSDC-RI MSDC-RI MSDC-RI

Condensed phase thermochemistry data

Data compiled by: Hussein Y. Afeefy, Joel F. Liebman, and Stephen E. Stein

Quantity Value Units Method Reference Comment
Δfsolid-138.kJ/molCcbDelephine, 1903
Quantity Value Units Method Reference Comment
Δcsolid-5286.9kJ/molCcbDelephine, 1903

Normal alkane RI, non-polar column, custom temperature program

Data compiled by: NIST Mass Spectrometry Data Center, William E. Wallace, director

Column type CapillaryCapillary
Active phase DB-1DB-1
Column length (m) 60.60.
Carrier gas
Substrate
Column diameter (mm) 0.250.25
Phase thickness (μm) 0.250.25
Program not specifiednot specified
I 1181.1181.
ReferenceKawai, Ishida, et al., 1991Kawai, Ishida, et al., 1991
Comment MSDC-RI MSDC-RI

References

Liu, Yang, et al., 2001
Liu, T.-T.; Yang, T.-S.; Wu, C.-M., Changes of volatiles in soy sauce-stewed pork during cold storage and reheating, J. Sci. Food Agric., 2001, 81, 15, 1547-1552, https://doi.org/10.1002/jsfa.978 . [all data]

Chung, 1999
Chung, H.Y., Volatile components in fermented soybean (Glycine max) curds, J. Agric. Food Chem., 1999, 47, 7, 2690-2696, https://doi.org/10.1021/jf981166a . [all data]

Chung, Eiserich, et al., 1994
Chung, T.Y.; Eiserich, J.P.; Shibamoto, T., Volatile compounds produced from peanut oil heated with different amounts of cysteine, J. Agric. Food Chem., 1994, 42, 8, 1743-1746, https://doi.org/10.1021/jf00044a032 . [all data]