Benzene, 1,2-dimethoxy-4-propenyl-, (Z)-

Van Den Dool and Kratz RI, polar column, temperature ramp

Data compiled by: NIST Mass Spectrometry Data Center, William E. Wallace, director

Column type CapillaryCapillaryCapillary
Active phase AT-WaxCP-Wax 52CBCP-Wax 52CB
Column length (m) 60.50.50.
Carrier gas He
Substrate
Column diameter (mm) 0.320.320.32
Phase thickness (μm) 0.25
Tstart (C) 65.60.60.
Tend (C) 250.220.220.
Heat rate (K/min) 2.4.4.
Initial hold (min) 10.5.5.
Final hold (min) 60.30.30.
I 2059.2008.2008.
ReferencePino, Marbot, et al., 2001Chevance and Farmer, 1999Chevance and Farmer, 1999, 2
Comment MSDC-RI MSDC-RI MSDC-RI

Van Den Dool and Kratz RI, non-polar column, temperature ramp

Data compiled by: NIST Mass Spectrometry Data Center, William E. Wallace, director

Column type CapillaryCapillary
Active phase HP-1CP Sil 5 CB
Column length (m) 24.50.
Carrier gas HeHe
Substrate
Column diameter (mm) 0.320.32
Phase thickness (μm) 0.170.4
Tstart (C) 60.60.
Tend (C) 250.280.
Heat rate (K/min) 4.3.
Initial hold (min) 2.10.
Final hold (min) 20.60.
I 1422.1420.
ReferenceNath, Sarma, et al., 2002Pino, Marbot, et al., 2001
Comment MSDC-RI MSDC-RI

References

Pino, Marbot, et al., 2001
Pino, J.A.; Marbot, R.; Vázquez, C., Characterization of volatiles in strawberry guava (Psidium cattleianum Sabine) fruit, J. Agric. Food Chem., 2001, 49, 12, 5883-5887, https://doi.org/10.1021/jf010414r . [all data]

Chevance and Farmer, 1999
Chevance, F.F.V.; Farmer, L.J., Identification of major volatile odor compounds in frankfurters, J. Agric. Food Chem., 1999, 47, 12, 5151-5160, https://doi.org/10.1021/jf990515d . [all data]

Chevance and Farmer, 1999, 2
Chevance, F.F.V.; Farmer, L.J., Release of volatile odor compounds from full-fat and reduced-fat frankfurters, J. Agric. Food Chem., 1999, 47, 12, 5161-5168, https://doi.org/10.1021/jf9905166 . [all data]