Benzene, 4-ethenyl-1,2-dimethoxy-

Normal alkane RI, non-polar column, temperature ramp

Data compiled by: NIST Mass Spectrometry Data Center, William E. Wallace, director

Column type CapillaryCapillaryCapillary
Active phase HP-5 MSDB-5Optima-5
Column length (m) 30.30.30.
Carrier gas Helium He
Substrate
Column diameter (mm) 0.250.250.2
Phase thickness (μm) 0.250.25
Tstart (C) 70.40.50.
Tend (C) 290.240.250.
Heat rate (K/min) 5.4.3.
Initial hold (min)  2.3.
Final hold (min) 10.
I 1365.1368.1374.
ReferenceRadulovic, Dordevic, et al., 2010El-Sayed, Heppelthwaite, et al., 2005Jacquemond-Collet, Bessière, et al., 2001
Comment MSDC-RI MSDC-RI MSDC-RI

Van Den Dool and Kratz RI, non-polar column, temperature ramp

Data compiled by: NIST Mass Spectrometry Data Center, William E. Wallace, director

Column type Capillary
Active phase HP-5MS
Column length (m) 30.
Carrier gas He
Substrate
Column diameter (mm) 0.25
Phase thickness (μm) 0.25
Tstart (C) 80.
Tend (C) 300.
Heat rate (K/min) 4.
Initial hold (min)
Final hold (min)
I 1367.6
ReferenceZhao C.X., Li, et al., 2006
Comment MSDC-RI

Phase change data

Data compiled by: Robert L. Brown and Stephen E. Stein

Reduced pressure boiling point

Tboil (K) Pressure (atm) Reference
395.70.013Aldrich Chemical Company Inc., 1990

Van Den Dool and Kratz RI, polar column, temperature ramp

View large format table.

Column type Active phase I Reference Comment
CapillaryZB-Wax2040.Ledauphin, Saint-Clair, et al., 200430. m/0.25 mm/0.15 μm, He, 35. C @ 5. min, 5. K/min, 220. C @ 10. min

Van Den Dool and Kratz RI, polar column, custom temperature program

View large format table.

Column type Active phase I Reference Comment
CapillaryDB-Wax2014.Cantergiani, Brevard, et al., 200130. m/0.25 mm/0.25 μm; Program: 20C(30s) => fast => 60C => 4C/min => 220C (20min)

Normal alkane RI, non-polar column, custom temperature program

View large format table.

Column type Active phase I Reference Comment
CapillaryHP-51370.Citron, Riclea, et al., 2011Program: not specified
CapillaryHP-51379.Citron, Riclea, et al., 2011Program: not specified
CapillaryDB-51354.Hamm, Bleton, et al., 200530. m/0.25 mm/0.25 μm, He; Program: 40C(1min) => 9C/min => 130C => 2C/min => 230C

Normal alkane RI, polar column, temperature ramp

View large format table.

Column type Active phase I Reference Comment
CapillaryCP-Wax1998.Mo, Fan, et al., 200960. m/0.25 mm/0.25 μm, Helium, 50. C @ 2. min, 6. K/min, 230. C @ 15. min

Normal alkane RI, polar column, custom temperature program

View large format table.

Column type Active phase I Reference Comment
CapillaryDB-Wax2039.Peng, Yang, et al., 1991Program: not specified

References

Radulovic, Dordevic, et al., 2010
Radulovic, N.; Dordevic, N.; Markovic, M.; Palic, R., Volatile constituents of Glechoma Hirsuta Waldst. Kit. and G. Hederacea L. (Lamiaceae), Bull. Chem. Soc. Ethiop., 2010, 24, 1, 67-76, https://doi.org/10.4314/bcse.v24i1.52962 . [all data]

El-Sayed, Heppelthwaite, et al., 2005
El-Sayed, A.M.; Heppelthwaite, V.J.; Manning, L.M.; Gibb, A.R.; Suckling, D.M., Volatile constituents of fermented sugar baits and their attraction to lepidopteran species, J. Agric. Food Chem., 2005, 53, 4, 953-958, https://doi.org/10.1021/jf048521j . [all data]

Jacquemond-Collet, Bessière, et al., 2001
Jacquemond-Collet, I.; Bessière, J.-M.; Hannedouche, S.; Bertrand, C.; Fourasté, I.; Moulis, C., Identification of the alkaloids of Galipea officinalis by gas chromatography-mass spectrometry, Phytochem. Anal., 2001, 12, 5, 312-319, https://doi.org/10.1002/pca.594 . [all data]