Pentane, 2-iodo-

Kovats' RI, polar column, isothermal

Data compiled by: NIST Mass Spectrometry Data Center, William E. Wallace, director

Column type Packed
Active phase Carbowax 20M
Column length (m) 3.
Carrier gas N2
Substrate Chromosorb W DMCS
Column diameter (mm)
Phase thickness (μm)
Temperature (C) 75.
I 1092.
ReferenceCastello, 1984
Comment MSDC-RI

References

Castello, 1984
Castello, G., Gas Chromatographic Identification of Alkyl Radicals Formed in Plasma Radiofrequency Discharges by Using Iodine as a Scavenger, J. Chromatogr., 1984, 303, 61-66, https://doi.org/10.1016/S0021-9673(01)96045-5 . [all data]