(E)-Methyl isoeugenol

Normal alkane RI, non-polar column, custom temperature program

Data compiled by: NIST Mass Spectrometry Data Center, William E. Wallace, director

Column type CapillaryCapillaryCapillary
Active phase HP-5MSBPX-5SE-30
Column length (m) 30.30.
Carrier gas HeHe
Substrate
Column diameter (mm) 0.250.32
Phase thickness (μm) 0.250.5
Program 40C(10min) => 3C/min => 200C => 2C/min => 220C60C(1min) => 3.5C/min => 180C => 20C/min => 280C(2min)not specified
I 1499.1500.1459.
ReferenceCole, Haber, et al., 2007Koutsoudaki, Krsek, et al., 2005Vinogradov, 2004
Comment MSDC-RI MSDC-RI MSDC-RI

Kovats' RI, non-polar column, temperature ramp

Data compiled by: NIST Mass Spectrometry Data Center, William E. Wallace, director

Column type CapillaryCapillaryCapillary
Active phase SE-54DB-5DB-1
Column length (m) 30.30.28.
Carrier gas HeHeHe
Substrate
Column diameter (mm) 0.260.260.25
Phase thickness (μm) 0.250.250.25
Tstart (C) 60.60.50.
Tend (C) 246.240.270.
Heat rate (K/min) 3.3.4.
Initial hold (min)   1.
Final hold (min)
I 1495.1495.1466.
ReferenceAdams, 2000Adams, 2000, 2Saad, El-Sharkawy, et al., 1995
Comment MSDC-RI MSDC-RI MSDC-RI

Kovats' RI, non-polar column, custom temperature program

Data compiled by: NIST Mass Spectrometry Data Center, William E. Wallace, director

Column type CapillaryCapillary
Active phase DB-5DB-5
Column length (m) 30.30.
Carrier gas  He
Substrate
Column diameter (mm) 0.260.25
Phase thickness (μm) 0.250.25
Program not specified40C => 2C/min => 60C => 4C/min => 240C
I 1495.1495.
ReferenceAdams, 1998Santos, Andrade, et al., 1998
Comment MSDC-RI MSDC-RI

References

Cole, Haber, et al., 2007
Cole, R.A.; Haber, W.A.; Setzer, W.N., Chemical composition of essential oils of seven species of Eugenia from Monteverde, Costa Rica, Biochem. Syst. Ecol., 2007, 35, 12, 877-886, https://doi.org/10.1016/j.bse.2007.06.013 . [all data]

Koutsoudaki, Krsek, et al., 2005
Koutsoudaki, C.; Krsek, M.; Rodger, A., Chemical composition and antibacterial activity of the essential oil and the gum of pistacia lentiscus Var. chia, J. Agric. Food Chem., 2005, 53, 20, 7681-7685, https://doi.org/10.1021/jf050639s . [all data]

Vinogradov, 2004
Vinogradov, B.A., Production, composition, properties and application of essential oils, 2004, retrieved from http://viness.narod.ru. [all data]