Iron,dicarbonylbis(diphenylcarbamodithioato-s,s')-(oc-6-21)-

Gas phase ion energetics data

Data compiled by: Sharon G. Lias, Rhoda D. Levin, and Sherif A. Kafafi

Ionization energy determinations

IE (eV) Method Reference Comment
7.58PECauletti, Duffy, et al., 1977Vertical value

References

Cauletti, Duffy, et al., 1977
Cauletti, C.; Duffy, N.V.; Furlani, C.L., UV photoelectron spectra of some substituted iron dithiocarbamates, Inorg. Chim. Acta, 1977, 23, 181. [all data]