2-Amino-4-acetamino anisole

Condensed phase thermochemistry data

Data compiled by: Hussein Y. Afeefy, Joel F. Liebman, and Stephen E. Stein

Quantity Value Units Method Reference Comment
Δfsolid-554. ± 5.8kJ/molCcbContineanu, Bretcanu, et al., 1982
Quantity Value Units Method Reference Comment
Δcsolid-4702.5 ± 5.8kJ/molCcbContineanu, Bretcanu, et al., 1982

References

Contineanu, Bretcanu, et al., 1982
Contineanu, I.; Bretcanu, D.; Marchidas, D.I., The enthalpies of combustion and formation of 3-amino-4-methoxyacetanilide and 3-(N-β-cycanoethyl)-amino-4-methoxyacetanilide, Rev. Roum. Chim., 1982, 27, 55-58. [all data]