Propanoic acid, phenyl ester

Phase change data

Data compiled by: Thermodynamics Research Center, NIST Boulder Laboratories, Chris Muzny director

Quantity Value Units Method Reference Comment
Tboil485.15KN/APerkin, 1896Uncertainty assigned by TRC = 1. K
Quantity Value Units Method Reference Comment
Tfus292.7KN/AHurd, Perletz, et al., 1945Uncertainty assigned by TRC = 1. K

In addition to the Thermodynamics Research Center (TRC) data available from this site, much more physical and chemical property data is available from the following TRC products:

Kovats' RI, non-polar column, isothermal

View large format table.

Column type Active phase Temperature (C) I Reference Comment
PackedSE-30200.1151.Haken, Hartley, et al., 1983Chromosorb W AW DMCS; Column length: 3.7 m

Normal alkane RI, polar column, custom temperature program

View large format table.

Column type Active phase I Reference Comment
CapillaryDB-Wax1720.Kim. J.H., Ahn, et al., 200460. m/0.25 mm/0.25 μm, Helium; Program: 60 0C (3 min) 2 0C/min -> 150 0C 4 0C/min -> 200 0C

References

Perkin, 1896
Perkin, W.H., LXIX. On Magnetic Rotatory Power, especially of Aromatic Compounds, J. Chem. Soc., 1896, 69, 1025-1257. [all data]

Hurd, Perletz, et al., 1945
Hurd, C.D.; Perletz, P.; Drake, S.S., Attempts to Isolate Methylketene by Pyrolytic Methods, J. Org. Chem., 1945, 10, 62-6. [all data]

Haken, Hartley, et al., 1983
Haken, J.K.; Hartley, H.N.T.; Srisukh, D., Retention increments of aromatic esters, Chromatographia, 1983, 17, 11, 589-596, https://doi.org/10.1007/BF02261941 . [all data]

Kim. J.H., Ahn, et al., 2004
Kim. J.H.; Ahn, H.J.; Yook, H.S.; Kim, K.S.; Rhee, M.S.; Ryu, G.H.; Byun, M.W., Color, flavor, and sensory characteristics of gamma-irradiated salted and fermented anchovy sauce, Radiation Phys. Chem., 2004, 69, 2, 179-187, https://doi.org/10.1016/S0969-806X(03)00400-6 . [all data]