C5H10N2O3

Reaction thermochemistry data

Data compiled by: John E. Bartmess

Individual Reactions

C5H9N2O3- + Hydrogen cation = C5H10N2O3

By formula: C5H9N2O3- + H+ = C5H10N2O3

Quantity Value Units Method Reference Comment
Δr1375. ± 20.kJ/molIMRBLi, Matus, et al., 2007gas phase; Calculations indicate cyclized (H-bonded) anion; side chain acidic site

References

Li, Matus, et al., 2007
Li, Z.; Matus, M.H.; Velazquez, H.A.; Dixon, D.A.; Cassady, C.J., Gas-phase acidities of aspartic acid, glutamic acid, and their amino acid amides, Int. J. Mass Spectrom., 2007, 265, 2-3, 213-223, https://doi.org/10.1016/j.ijms.2007.02.009 . [all data]