Benzenamine, 2,4,5-trichloro-

Phase change data

Data compiled as indicated in comments:
BS - Robert L. Brown and Stephen E. Stein
AC - William E. Acree, Jr., James S. Chickos

Quantity Value Units Method Reference Comment
Tboil543.2KN/AWeast and Grasselli, 1989BS
Quantity Value Units Method Reference Comment
Δsub20.6 ± 0.60kcal/molCRibeiro da Silva, Amaral, et al., 2002AC

References

Weast and Grasselli, 1989
CRC Handbook of Data on Organic Compounds, 2nd Editon, Weast,R.C and Grasselli, J.G., ed(s)., CRC Press, Inc., Boca Raton, FL, 1989, 1. [all data]

Ribeiro da Silva, Amaral, et al., 2002
Ribeiro da Silva, Manuel A.V.; Amaral, Luisa M.P.F.; Ferreira, Ana I.M.C.L., Standard molar enthalpies of formation of some trichloroanilines by rotating-bomb calorimetry, The Journal of Chemical Thermodynamics, 2002, 34, 1, 119-127, https://doi.org/10.1006/jcht.2001.0905 . [all data]