Benzene, 1,2,4,5-tetrakis(1-methylethyl)-

Phase change data

Data compiled as indicated in comments:
BS - Robert L. Brown and Stephen E. Stein
TRC - Thermodynamics Research Center, NIST Boulder Laboratories, Chris Muzny director
AC - William E. Acree, Jr., James S. Chickos

Quantity Value Units Method Reference Comment
Tfus412.KN/AIpatieff, Corson, et al., 1936Uncertainty assigned by TRC = 1.5 K; TRC

Reduced pressure boiling point

Tboil (K) Pressure (atm) Reference Comment
488.70.092Aldrich Chemical Company Inc., 1990BS

Enthalpy of vaporization

ΔvapH (kcal/mol) Temperature (K) Method Reference Comment
14.6 ± 0.07420.EBSteele, Chirico, et al., 2002Based on data from 410. - 575. K.; AC
13.6 ± 0.07460.EBSteele, Chirico, et al., 2002Based on data from 410. - 575. K.; AC
12.5 ± 0.1500.EBSteele, Chirico, et al., 2002Based on data from 410. - 575. K.; AC
11.4 ± 0.2540.EBSteele, Chirico, et al., 2002Based on data from 410. - 575. K.; AC

Enthalpy of fusion

ΔfusH (kcal/mol) Temperature (K) Reference Comment
4.68393.Steele, Chirico, et al., 2002AC

In addition to the Thermodynamics Research Center (TRC) data available from this site, much more physical and chemical property data is available from the following TRC products:

Kovats' RI, polar column, isothermal

Data compiled by: NIST Mass Spectrometry Data Center, William E. Wallace, director

Column type Capillary
Active phase Carbowax 20M
Column length (m) 100.
Carrier gas N2
Substrate
Column diameter (mm) 0.23
Phase thickness (μm)
Temperature (C) 100.
I 1569.6
ReferenceEngewald and Wennrich, 1976
Comment MSDC-RI

Kovats' RI, non-polar column, isothermal

Data compiled by: NIST Mass Spectrometry Data Center, William E. Wallace, director

Column type Capillary
Active phase Squalane
Column length (m) 100.
Carrier gas N2
Substrate
Column diameter (mm) 0.23
Phase thickness (μm)
Temperature (C) 100.
I 1406.
ReferenceEngewald and Wennrich, 1976
Comment MSDC-RI

References

Ipatieff, Corson, et al., 1936
Ipatieff, V.N.; Corson, B.B.; Pines, H., Influence of Sulfuric Acid Concentration upon Reaction between Olefins and Benzene, J. Am. Chem. Soc., 1936, 58, 919-22. [all data]

Aldrich Chemical Company Inc., 1990
Aldrich Chemical Company Inc., Catalog Handbook of Fine Chemicals, Aldrich Chemical Company, Inc., Milwaukee WI, 1990, 1. [all data]

Steele, Chirico, et al., 2002
Steele, W.V.; Chirico, R.D.; Cowell, A.B.; Knipmeyer, S.E.; Nguyen, A., Thermodynamic Properties and Ideal-Gas Enthalpies of Formation for 1,4-Diisopropylbenzene, 1,2,4,5-Tetraisopropylbenzene, Cyclohexanone Oxime, Dimethyl Malonate, Glutaric Acid, and Pimelic Acid, J. Chem. Eng. Data, 2002, 47, 4, 725-739, https://doi.org/10.1021/je010088b . [all data]