Benzenamine, 2,4,6-trichloro-

Van Den Dool and Kratz RI, non-polar column, custom temperature program

View large format table.

Column type Active phase I Reference Comment
Capillary5 % Phenyl methyl siloxane1398.Yasuhara, Shiraishi, et al., 199725. m/0.31 mm/0.52 μm, He; Program: 50C(2min) => (20C/min) => 120C => (7C/min) => 310C(10min)

Normal alkane RI, non-polar column, temperature ramp

View large format table.

Column type Active phase I Reference Comment
CapillaryTR-11367.Gruzdev, Alferova, et al., 201130. m/0.32 mm/0.25 μm, Helium, 5. K/min; Tstart: 50. C; Tend: 300. C
CapillaryTR-11371.Gruzdev, Alferova, et al., 201130. m/0.32 mm/0.25 μm, Helium, 5. K/min; Tstart: 50. C; Tend: 300. C
CapillaryTR-11379.Gruzdev, Alferova, et al., 201130. m/0.32 mm/0.25 μm, Helium, 5. K/min; Tstart: 50. C; Tend: 300. C
CapillaryTR-11367.Gruzdev, Alferova, et al., 2011, 230. m/0.32 mm/0.25 μm, Helium, 5. K/min; Tstart: 50. C; Tend: 300. C
CapillaryTR-11367.Gruzdev, Filippova, et al., 201130. m/0.32 mm/0.25 μm, Helium, 5. K/min; Tstart: 50. C; Tend: 300. C
CapillaryUltra-11362.Okumura, 199125. m/0.32 mm/0.25 μm, He, 3. K/min; Tstart: 80. C; Tend: 260. C

Phase change data

Data compiled as indicated in comments:
BS - Robert L. Brown and Stephen E. Stein
AC - William E. Acree, Jr., James S. Chickos

Quantity Value Units Method Reference Comment
Tboil535.2KN/AAldrich Chemical Company Inc., 1990BS
Quantity Value Units Method Reference Comment
Δsub85.3 ± 1.9kJ/molCRibeiro da Silva, Amaral, et al., 2002AC

Reduced pressure boiling point

Tboil (K) Pressure (bar) Reference Comment
535.20.995Weast and Grasselli, 1989BS

Enthalpy of vaporization

ΔvapH (kJ/mol) Temperature (K) Method Reference Comment
92.9422.AStephenson and Malanowski, 1987Enthalpy of vaporization is likely in error; AC

Antoine Equation Parameters

log10(P) = A − (B / (T + C))
    P = vapor pressure (bar)
    T = temperature (K)

View plot Requires a JavaScript / HTML 5 canvas capable browser.

Temperature (K) A B C Reference Comment
407. - 535.8.359644193.58-33.571Stull, 1947Coefficents calculated by NIST from author's data.

References

Yasuhara, Shiraishi, et al., 1997
Yasuhara, A.; Shiraishi, H.; Nishikawa, M.; Yamamoto, T.; Uehiro, T.; Nakasugi, O.; Okumura, T.; Kenmotsu, K.; Fukui, H.; Nagase, M.; Ono, Y.; Kawagoshi, Y.; Baba, K.; Noma, Y., Determination of organic components in leachates from hazardous waste disposal sites in Japan by gas chromatography-mass spectrometry, J. Chromatogr. A, 1997, 774, 1-2, 321-332, https://doi.org/10.1016/S0021-9673(97)00078-2 . [all data]

Gruzdev, Alferova, et al., 2011
Gruzdev, I.V.; Alferova, M.V.; Kondratenok, B.M.; Zenkevich, I.G., Gas-chromatographic identification of chloro- and bromosubstituted anilines using retention indices, Rus. J. Anal. Chem., 2011, 66, 5, 519-524. [all data]

Gruzdev, Alferova, et al., 2011, 2
Gruzdev, I.V.; Alferova, M.V.; Kondratenok, B.M.; Zenkevich, I.G., Quantification of chloroanilines in drinking water by gas chromatography as bromo derivatives, Rus. J. Anal. Chem., 2011, 66, 10, 955-962, https://doi.org/10.1134/S1061934811100042 . [all data]

Gruzdev, Filippova, et al., 2011
Gruzdev, I.V.; Filippova, M.V.; Zenkevich, I.G.; Kondratenok, B.M., Identification of bromination products of chlorosubstituted anilines in aqueous media by using gas chromatography, Rus. J. Applied Chem., 2011, 84, 10, 1656-1667, https://doi.org/10.1134/S1070427211100132 . [all data]

Okumura, 1991
Okumura, T., retention indices of environmental chemicals on methyl silicone capillary column, Journal of Environmental Chemistry (Japan), 1991, 1, 2, 333-358, https://doi.org/10.5985/jec.1.333 . [all data]