Benzenamine, 3,4,5-trichloro-

Phase change data

Data compiled by: William E. Acree, Jr., James S. Chickos

Quantity Value Units Method Reference Comment
Δsub22.2 ± 0.79kcal/molCRibeiro da Silva, Amaral, et al., 2002

Normal alkane RI, non-polar column, temperature ramp

View large format table.

Column type Active phase I Reference Comment
CapillaryTR-11581.Gruzdev, Filippova, et al., 201130. m/0.32 mm/0.25 μm, Helium, 5. K/min; Tstart: 50. C; Tend: 300. C

References

Ribeiro da Silva, Amaral, et al., 2002
Ribeiro da Silva, Manuel A.V.; Amaral, Luisa M.P.F.; Ferreira, Ana I.M.C.L., Standard molar enthalpies of formation of some trichloroanilines by rotating-bomb calorimetry, The Journal of Chemical Thermodynamics, 2002, 34, 1, 119-127, https://doi.org/10.1006/jcht.2001.0905 . [all data]

Gruzdev, Filippova, et al., 2011
Gruzdev, I.V.; Filippova, M.V.; Zenkevich, I.G.; Kondratenok, B.M., Identification of bromination products of chlorosubstituted anilines in aqueous media by using gas chromatography, Rus. J. Applied Chem., 2011, 84, 10, 1656-1667, https://doi.org/10.1134/S1070427211100132 . [all data]