Rhodium, bis(ethylene)-indenyl-

Gas phase ion energetics data

Data compiled by: Sharon G. Lias and Joel F. Liebman

Ionization energy determinations

IE (eV) Method Reference Comment
7.19PEFrankcom, Green, et al., 1993Vertical value

References

Frankcom, Green, et al., 1993
Frankcom, T.M.; Green, J.C.; Nagy, A.; Kakkar, A.K.; Marder, T.B., Electronic structure and photoelectron spectroscopy of d8 rhodium indenyl complexes, Organometallics, 1993, 12, 3688. [all data]