Thallium propionate

Phase change data

Data compiled as indicated in comments:
TRC - Thermodynamics Research Center, NIST Boulder Laboratories, Chris Muzny director
DH - Eugene S. Domalski and Elizabeth D. Hearing

Quantity Value Units Method Reference Comment
Tfus468.0KN/AFernandez-Martin, Lopez de la Fuente, et al., 1984Crystal phase 1 phase; Uncertainty assigned by TRC = 0.5 K; TRC
Tfus468.KN/AMeisel, Seybold, et al., 1976Crystal phase 1 phase; Uncertainty assigned by TRC = 1. K; TRC
Quantity Value Units Method Reference Comment
Ttriple468.0KN/AFernandez-Martin, Cheda, et al., 1994Crystal phase 1 phase; Uncertainty assigned by TRC = 0.4 K; TRC

Enthalpy of phase transition

ΔHtrs (kJ/mol) Temperature (K) Initial Phase Final Phase Reference Comment
0.316364.8crystaline, IIcrystaline, IFernandez-Martin, Lopez de la Fuente, et al., 1984, 2DH
10.476468.0crystaline, IliquidFernandez-Martin, Lopez de la Fuente, et al., 1984, 2DH
0.377365.crystaline, IIcrystaline, IMeisel, Seybold, et al., 1976, 2DH
9.205468.crystaline, IliquidMeisel, Seybold, et al., 1976, 2DH

Entropy of phase transition

ΔStrs (J/mol*K) Temperature (K) Initial Phase Final Phase Reference Comment
0.83364.8crystaline, IIcrystaline, IFernandez-Martin, Lopez de la Fuente, et al., 1984, 2DH
22.5468.0crystaline, IliquidFernandez-Martin, Lopez de la Fuente, et al., 1984, 2DH
1.05365.crystaline, IIcrystaline, IMeisel, Seybold, et al., 1976, 2DH
20.1468.crystaline, I, Solidliquid, mesophaseMeisel, Seybold, et al., 1976, 2DH

In addition to the Thermodynamics Research Center (TRC) data available from this site, much more physical and chemical property data is available from the following TRC products:

References

Fernandez-Martin, Lopez de la Fuente, et al., 1984
Fernandez-Martin, F.; Lopez de la Fuente, F.L.; Cheda, J.A.R., DSC thermophysics on some lower thallium(I) n-alkanoates, Thermochim. Acta, 1984, 73, 109. [all data]

Meisel, Seybold, et al., 1976
Meisel, T.; Seybold, K.; Halmos, Z.; Roth, J.; Melykuti, C., Thermal behavior of thallium(I) fatty acid salts. I., J. Therm. Anal., 1976, 10, 419-31. [all data]

Fernandez-Martin, Cheda, et al., 1994
Fernandez-Martin, F.; Cheda, J.A.R.; Jones, L.L.; Lin, C.C.; Westrum, E.F., Thermodynamics of the thallium alkanoates VIII. Heat capacity and derived thermophysical properties of thallium(I) propanoate and pentanoate at temperatures from 6 to 490 K, J. Chem. Thermodyn., 1994, 26, 925. [all data]

Fernandez-Martin, Lopez de la Fuente, et al., 1984, 2
Fernandez-Martin, F.; Lopez de la Fuente, F.L.; Cheda, J.A.R., DSC thermophysics on some lower thallium(I) n-alkanoates, Thermochim. Acta, 1984, 73, 109-115. [all data]

Meisel, Seybold, et al., 1976, 2
Meisel, T.; Seybold, K.; Halmos, Z.; Roth, J.; Melykuti, C., Thermal behavior of thallium(I) fatty acid salts. I, J. Therm. Anal., 1976, 10, 419-431. [all data]