Phendimetrazine

Van Den Dool and Kratz RI, non-polar column, temperature ramp

Data compiled by: NIST Mass Spectrometry Data Center, William E. Wallace, director

Column type CapillaryPacked
Active phase SE-30SE-30
Column length (m) 15.1.8
Carrier gas HeN2
Substrate  Chromosorb W
Column diameter (mm) 0.25
Phase thickness (μm) 0.25
Tstart (C) 100.130.
Tend (C) 295.290.
Heat rate (K/min) 5.8.
Initial hold (min)  2.
Final hold (min)  8.
I 1431.1445.
ReferenceAnderson and Stafford, 1983Perrigo and Peel, 1981
Comment MSDC-RI MSDC-RI

References

Anderson and Stafford, 1983
Anderson, W.H.; Stafford, D.T., Applications of capillary gas chromatography in routine toxicological analyses, J. Hi. Res. Chromatogr. Chromatogr. Comm., 1983, 6, 5, 247-254, https://doi.org/10.1002/jhrc.1240060506 . [all data]

Perrigo and Peel, 1981
Perrigo, B.J.; Peel, H.W., The use of retention indices and temperature-programmed gas chromatography in analytical toxicology, J. Chromatogr. Sci., 1981, 19, 5, 219-226, https://doi.org/10.1093/chromsci/19.5.219 . [all data]