Hydrazine,1,2-bis(1-methylethyl)-1,2-diphenyl-

Gas phase ion energetics data

Data compiled by: Sharon G. Lias, Rhoda D. Levin, and Sherif A. Kafafi

Ionization energy determinations

IE (eV) Method Reference
7.20 ± 0.05PERademacher, Bass, et al., 1977

References

Rademacher, Bass, et al., 1977
Rademacher, P.; Bass, V.-M.; Wildemann, M.; Weger, H., Photoelektronenspektren und Konformation von Hydrazobenzolen, Chem. Ber., 1977, 110, 1939. [all data]