2,5-dimethyl-3-(methylthio)furan

Gas phase ion energetics data

Data compiled by: Sharon G. Lias, Rhoda D. Levin, and Sherif A. Kafafi

Ionization energy determinations

IE (eV) Method Reference
7.91 ± 0.05EICederlund, Lantz, et al., 1977

Normal alkane RI, polar column, temperature ramp

View large format table.

Column type Active phase I Reference Comment
CapillaryCarbowax 20M1440.Tressl and Silwar, 1981He, 2. K/min; Column length: 50. m; Column diameter: 0.25 mm; Tstart: 70. C; Tend: 180. C

References

Cederlund, Lantz, et al., 1977
Cederlund, B.; Lantz, R.; Hornfeldt, A.-B.; Thorstad, O.; Undheim, K., Preparation of some thiophene-, selenophene- and furanthiols. Ionisation potentials in tautomer analysis, Acta Chem. Scand. Ser. B:, 1977, 31, 198. [all data]