Molybdenum, tris(methylimidodiphosphorous tetrafluoride-p,p')-

Gas phase ion energetics data

Data compiled by: Sharon G. Lias, Rhoda D. Levin, and Sherif A. Kafafi

Ionization energy determinations

IE (eV) Method Reference Comment
7.93PEAndreocci, Cauletti, et al., 1979Vertical value

References

Andreocci, Cauletti, et al., 1979
Andreocci, M.V.; Cauletti, C.; Furlani, C.; King, R.B., UV photoelectron study of mononuclear metal complexes of methylaminobis(difluorophosphine), Inorg. Chem., 1979, 18, 954. [all data]