Propargyldipropylamine

Condensed phase thermochemistry data

Data compiled by: Hussein Y. Afeefy, Joel F. Liebman, and Stephen E. Stein

Quantity Value Units Method Reference Comment
Δfliquid84. ± 3.kJ/molCcbLebedeva and Oleinikova, 1971Heat of combustion is not reported

References

Lebedeva and Oleinikova, 1971
Lebedeva, N.D.; Oleinikova, T.P., Heats of combustion and enthalpies of formation of unsaturated amines, Russ. J. Phys. Chem. (Engl. Transl.), 1971, 45, 1193. [all data]