1-Octen-3-yl-n-propionate

Van Den Dool and Kratz RI, non-polar column, custom temperature program

View large format table.

Column type Active phase I Reference Comment
CapillaryDB-11181.Suliman F.E.O., Fatope M.O., et al., 200630. m/0.25 mm/0.25 μm, He; Program: 35C => 2C/min => 200C => 5C/min => 240C

References

Suliman F.E.O., Fatope M.O., et al., 2006
Suliman F.E.O.; Fatope M.O.; Al-Saidi S.H.; Al-Kindy S.M.Z.; Marwah R.G., Composition and antimicrobial activity of the essential oil of Pluchea arabica from Oman, Flavour Fragr. J., 2006, 21, 3, 469-471, https://doi.org/10.1002/ffj.1616 . [all data]