Heptadecanal-

Van Den Dool and Kratz RI, non-polar column, temperature ramp

Data compiled by: NIST Mass Spectrometry Data Center, William E. Wallace, director

Column type CapillaryCapillaryCapillaryCapillary
Active phase 5 % Phenyl methyl siloxaneSPB-1OV-101OV-101
Column length (m) 30.30.50.50.
Carrier gas  HeN2N2
Substrate
Column diameter (mm) 0.250.250.250.25
Phase thickness (μm) 0.250.25
Tstart (C) 60.35.80.80.
Tend (C) 270.225.200.200.
Heat rate (K/min) 15.4.2.2.
Initial hold (min)  5.
Final hold (min) 15.20.
I 1937.1895.1894.1895.
ReferenceZaikin, 2010Chisholm, Jell, et al., 2003Yang, Sugisawa, et al., 1992Yang, Sugisawa, et al., 1992
Comment MSDC-RI MSDC-RI MSDC-RI MSDC-RI

Kovats' RI, non-polar column, temperature ramp

Data compiled by: NIST Mass Spectrometry Data Center, William E. Wallace, director

Column type CapillaryCapillaryCapillaryCapillary
Active phase DB-1DB-1OV-101OV-101
Column length (m) 60.60.50.50.
Carrier gas
Substrate
Column diameter (mm) 0.250.250.230.23
Phase thickness (μm) 0.250.25
Tstart (C) 30.30.80.80.
Tend (C) 220.220.200.200.
Heat rate (K/min) 2.2.2.2.
Initial hold (min) 4.4.
Final hold (min)
I 1897.1898.1880.1880.
ReferenceTakeoka, Perrino, et al., 1996Takeoka, Perrino, et al., 1996Ohnishi and Shibamoto, 1984Ohnishi and Shibamoto, 1984
Comment MSDC-RI MSDC-RI MSDC-RI MSDC-RI

Normal alkane RI, non-polar column, custom temperature program

Data compiled by: NIST Mass Spectrometry Data Center, William E. Wallace, director

Column type Capillary
Active phase BPX-5
Column length (m) 50.
Carrier gas Helium
Substrate
Column diameter (mm) 0.32
Phase thickness (μm) 0.50
Program 40 0C (5 min) 20 0C/min -> 60 0C (5 min) 4 0C/min -> 250 0C (10 min)
I 1930.
ReferenceMadruga, Arruda, et al., 2000
Comment MSDC-RI

References

Zaikin, 2010
Zaikin, V.G., Personal communication: Retention indices measured during 2010, 2010. [all data]

Chisholm, Jell, et al., 2003
Chisholm, M.G.; Jell, J.A.; Cass, D.M., Jr., Characterization of the major odorants found in the peel oil of Citrus reticulata Blanco cv. Clementine using gas chromatography-olfactometry, Flavour Fragr. J., 2003, 18, 4, 275-281, https://doi.org/10.1002/ffj.1188 . [all data]

Yang, Sugisawa, et al., 1992
Yang, R.; Sugisawa, H.; Nakatani, H.; Tamura, H.; Takagi, N., Comparison of odor quality in peel oils of acid citrus, Nippon Shokuhin Kogyo Gakkaishi, 1992, 39, 1, 16-24, https://doi.org/10.3136/nskkk1962.39.16 . [all data]