1-Hexadecyne

Phase change data

Data compiled as indicated in comments:
BS - Robert L. Brown and Stephen E. Stein
TRC - Thermodynamics Research Center, NIST Boulder Laboratories, Chris Muzny director

Quantity Value Units Method Reference Comment
Tfus288.KN/ALangedijk and Stedehouder, 1937Uncertainty assigned by TRC = 2. K; TRC

Reduced pressure boiling point

Tboil (K) Pressure (bar) Reference Comment
421.0.013Farchan Laboratories, 1990BS

In addition to the Thermodynamics Research Center (TRC) data available from this site, much more physical and chemical property data is available from the following TRC products:

Normal alkane RI, non-polar column, temperature ramp

View large format table.

Column type Active phase I Reference Comment
CapillaryOV-1011664.Stern, Flath, et al., 198550. C @ 0.1 min, 4. K/min, 225. C @ 30. min; Column length: 50. m; Column diameter: 0.32 mm

References

Langedijk and Stedehouder, 1937
Langedijk, S.L.; Stedehouder, P.L., Recl. Trav. Chim. Pays-Bas, 1937, 56, 526. [all data]

Farchan Laboratories, 1990
Farchan Laboratories, Research Chemicals Catalog, Farchan Laboratories, Gainesville, FL, 1990, 91. [all data]