(E) 11-octadecen-1-ol

Phase change data

Data compiled by: William E. Acree, Jr., James S. Chickos

Quantity Value Units Method Reference Comment
Δvap28.78kcal/molCGCOva, Koultek, et al., 2000Based on data from 393. - 433. K. See also Koutek, Hoskovec, et al., 1994.

References

Ova, Koultek, et al., 2000
Ova, P.V.; Koultek, B.; Hoskovec, M., Practice Oriented Results on Use and Production of Neem Ingredients and Pheromones VI, H. Kleeberg and C.P.W. Zebitz, ed(s)., Druck and Graphic, Giessen, 2000, 211-218. [all data]

Koutek, Hoskovec, et al., 1994
Koutek, Bohumír; Hoskovec, Michal; Vrkocová, Pavlína; Konecný, Karel; Feltl, Ladislav, Gas chromatographic determination of vapour pressures of pheromone-like compounds II. Alcohols, Journal of Chromatography A, 1994, 679, 2, 307-317, https://doi.org/10.1016/0021-9673(94)80573-3 . [all data]