2-Nonadecanone

Phase change data

Data compiled as indicated in comments:
BS - Robert L. Brown and Stephen E. Stein
TRC - Thermodynamics Research Center, NIST Boulder Laboratories, Chris Muzny director
AC - William E. Acree, Jr., James S. Chickos

Quantity Value Units Method Reference Comment
Tfus328.KN/AVilalta, Hammond, et al., 1993Uncertainty assigned by TRC = 0.1 K; TRC

Reduced pressure boiling point

Tboil (K) Pressure (bar) Reference Comment
539.70.147Weast and Grasselli, 1989BS

Enthalpy of fusion

ΔfusH (kJ/mol) Temperature (K) Method Reference Comment
68.65328.DSCVilalta, Hammond, et al., 1993, 2AC

In addition to the Thermodynamics Research Center (TRC) data available from this site, much more physical and chemical property data is available from the following TRC products:

Kovats' RI, non-polar column, isothermal

View large format table.

Column type Active phase Temperature (C) I Reference Comment
PackedOV-101220.2090.7Didaoui, Touabet, et al., 1997N2, Chromosorb G HP; Column length: 2. m
CapillarySE-30220.2087.1Didaoui, Touabet, et al., 199727. m/0.4 mm/1.13 μm, N2, Chromosorb G HP
CapillarySE-30200.2090.1Didaoui, Touabet, et al., 199727. m/0.4 mm/0.1 μm, N2, Chromosorb G HP
PackedApolane220.2066.3Didaoui, Touabet, et al., 19972. m/0.29 mm/0.28 μm, N2, Chromosorb G HP

Van Den Dool and Kratz RI, non-polar column, temperature ramp

View large format table.

Column type Active phase I Reference Comment
CapillaryDB-52106.Rostad and Pereira, 198630. m/0.26 mm/0.25 μm, He, 50. C @ 4. min, 6. K/min, 300. C @ 20. min

Normal alkane RI, non-polar column, isothermal

View large format table.

Column type Active phase Temperature (C) I Reference Comment
CapillaryOV-160.2071.Amboni, Junkes, et al., 2002

Normal alkane RI, non-polar column, temperature ramp

View large format table.

Column type Active phase I Reference Comment
CapillaryHP-5 MS2101.Kim and Chung, 200930. m/0.25 mm/0.25 μm, Helium, 35. C @ 5. min, 2. K/min, 195. C @ 30. min
CapillaryUltra-12085.Okumura, 199125. m/0.32 mm/0.25 μm, He, 3. K/min; Tstart: 80. C; Tend: 260. C

Normal alkane RI, non-polar column, custom temperature program

View large format table.

Column type Active phase I Reference Comment
CapillaryDB-12100.Touafek, Nacer, et al., 200530. m/0.25 mm/0.25 μm, He; Program: 45C => 3C/min => 175C => 15C/min => 300C (15min)
CapillaryPolydimethyl siloxane2071.Junkes, Castanho, et al., 2003Program: not specified

Lee's RI, non-polar column, temperature ramp

View large format table.

Column type Active phase I Reference Comment
CapillaryDB-5348.32Rostad and Pereira, 198630. m/0.26 mm/0.25 μm, He, 50. C @ 4. min, 6. K/min, 300. C @ 20. min

References

Vilalta, Hammond, et al., 1993
Vilalta, P.M.; Hammond, G.S.; Weiss, R.G., Determination of the solubilization sites afforded by smectic phases of (perfluorodecyl)decane [F(CF2)10(CH2)10H] to some linear ketones undergoing the Norrish II photoreactions, Langmuir, 1993, 9, 7, 1910, https://doi.org/10.1021/la00031a046 . [all data]

Weast and Grasselli, 1989
CRC Handbook of Data on Organic Compounds, 2nd Editon, Weast,R.C and Grasselli, J.G., ed(s)., CRC Press, Inc., Boca Raton, FL, 1989, 1. [all data]

Vilalta, Hammond, et al., 1993, 2
Vilalta, Patricia M.; Hammond, George S.; Weiss, Richard G., Determination of the solubilization sites afforded by smectic phases of (perfluorodecyl)decane [F(CF2)10(CH2)10H] to some linear ketones undergoing the Norrish II photoreactions, Langmuir, 1993, 9, 7, 1910-1921, https://doi.org/10.1021/la00031a046 . [all data]

Didaoui, Touabet, et al., 1997
Didaoui, L.; Touabet, A.; Meklati, B.Y., Comparison of mathematical methods for the calculation of retention indices at high temperature in gas chromatography, J. Hi. Res. Chromatogr., 1997, 20, 11, 605-610, https://doi.org/10.1002/jhrc.1240201107 . [all data]

Rostad and Pereira, 1986
Rostad, C.E.; Pereira, W.E., Kovats and Lee retention indices determined by gas chromatography/mass spectrometry for organic compounds of environmental interest, J. Hi. Res. Chromatogr. Chromatogr. Comm., 1986, 9, 6, 328-334, https://doi.org/10.1002/jhrc.1240090603 . [all data]

Amboni, Junkes, et al., 2002
Amboni, R.D.DeM.C.; Junkes, B. daS.; Yunes, R.A.; Heinzen, V.E.F., Quantitative structure-property relationships study of chromatographic retention indices and normal boiling points for oxo compounds using the semi-empirical topological method, J. Mol. Struct. (Theochem), 2002, 586, 1-3, 71-80, https://doi.org/10.1016/S0166-1280(02)00062-3 . [all data]

Kim and Chung, 2009
Kim, J.-S.; Chung, H.Y., GC-MS analysis of the volatile components in dried boxthorn (Lycium chimensis) Fruit, J. Korean Soc. Appl. Biol. Chem., 2009, 52, 5, 516-524, https://doi.org/10.3839/jksabc.2009.088 . [all data]

Okumura, 1991
Okumura, T., retention indices of environmental chemicals on methyl silicone capillary column, Journal of Environmental Chemistry (Japan), 1991, 1, 2, 333-358, https://doi.org/10.5985/jec.1.333 . [all data]

Touafek, Nacer, et al., 2005
Touafek, O.; Nacer, A.; Kabouche, A.; Kabouche, Z., Analysis of the Essential Oil of Algerian Hypericum perfoliatum (L), Flavour Fragr. J., 2005, 20, 6, 669-670, https://doi.org/10.1002/ffj.1545 . [all data]

Junkes, Castanho, et al., 2003
Junkes, B.S.; Castanho, R.D.M.; Amboni, C.; Yunes, R.A.; Heinzen, V.E.F., Semiempirical Topological Index: A Novel Molecular Descriptor for Quantitative Structure-Retention Relationship Studies, Internet Electronic Journal of Molecular Design, 2003, 2, 1, 33-49. [all data]