Hexane, 1,1'-thiobis-

Phase change data

Data compiled as indicated in comments:
BS - Robert L. Brown and Stephen E. Stein
AC - William E. Acree, Jr., James S. Chickos

Quantity Value Units Method Reference Comment
Tboil503.2KN/AWeast and Grasselli, 1989BS

Enthalpy of vaporization

ΔvapH (kJ/mol) Temperature (K) Reference Comment
72.4310.Sawaya, Mokbel, et al., 2004Based on data from 295. - 452. K.; AC

Van Den Dool and Kratz RI, non-polar column, temperature ramp

Data compiled by: NIST Mass Spectrometry Data Center, William E. Wallace, director

Column type Packed
Active phase SE-30
Column length (m) 1.8
Carrier gas N2
Substrate Chromaton N-AWHMDS
Column diameter (mm)
Phase thickness (μm)
Tstart (C) 80.
Tend (C) 250.
Heat rate (K/min) 3.9
Initial hold (min)
Final hold (min)
I 1473.
ReferenceZotov, Golovkin, et al., 1981
Comment MSDC-RI

References

Weast and Grasselli, 1989
CRC Handbook of Data on Organic Compounds, 2nd Editon, Weast,R.C and Grasselli, J.G., ed(s)., CRC Press, Inc., Boca Raton, FL, 1989, 1. [all data]

Sawaya, Mokbel, et al., 2004
Sawaya, Terufat; Mokbel, Ilham; Rauzy, Evelyne; Saab, Joseph; Berro, Charles; Jose, Jacques, Experimental vapor pressures of alkyl and aryl sulfides, Fluid Phase Equilibria, 2004, 226, 283-288, https://doi.org/10.1016/j.fluid.2004.10.007 . [all data]