Octane, 1-iodo-

Van Den Dool and Kratz RI, polar column, temperature ramp

Data compiled by: NIST Mass Spectrometry Data Center, William E. Wallace, director

Column type CapillaryCapillary
Active phase DB-WaxHP-Wax
Column length (m) 15.15.
Carrier gas HeHe
Substrate
Column diameter (mm) 0.530.53
Phase thickness (μm) 1.1.
Tstart (C) 40.40.
Tend (C) 220.220.
Heat rate (K/min) 5.5.
Initial hold (min) 3.3.
Final hold (min) 30.30.
I 1493.1487.
ReferencePeng, 2000Peng, 2000
Comment MSDC-RI MSDC-RI

Normal alkane RI, non-polar column, isothermal

Data compiled by: NIST Mass Spectrometry Data Center, William E. Wallace, director

Column type Capillary
Active phase Apiezon L
Column length (m)
Carrier gas
Substrate
Column diameter (mm)
Phase thickness (μm)
Temperature (C) 130.
I 1236.
ReferenceArruda, Junkes, et al., 2008
Comment MSDC-RI

Normal alkane RI, polar column, custom temperature program

Data compiled by: NIST Mass Spectrometry Data Center, William E. Wallace, director

Column type Capillary
Active phase DB-Wax
Column length (m)
Carrier gas
Substrate
Column diameter (mm)
Phase thickness (μm)
Program not specified
I 1508.
ReferencePeng, Yang, et al., 1991
Comment MSDC-RI

References

Peng, 2000
Peng, C.T., Prediction of retention indices. V. Influence of electronic effects and column polarity on retention index, J. Chromatogr. A, 2000, 903, 1-2, 117-143, https://doi.org/10.1016/S0021-9673(00)00901-8 . [all data]