Ethane, 1,2-diethoxy-

Normal alkane RI, non-polar column, custom temperature program

Data compiled by: NIST Mass Spectrometry Data Center, William E. Wallace, director

Column type CapillaryCapillaryCapillaryCapillaryPacked
Active phase Methyl SiliconePolydimethyl siloxanesDB-1DB-1Apiezon L
Column length (m)   60.60.
Carrier gas
Substrate
Column diameter (mm)   0.250.25
Phase thickness (μm)   0.250.25
Program not specifiednot specifiednot specifiednot specifiednot specified
I 787.787.771.773.744.8
ReferenceZenkevich, 1998Zenkevich, 1997Kawai, Ishida, et al., 1991Kawai, Ishida, et al., 1991Keiko, Prokop'ev, et al., 1972
Comment MSDC-RI MSDC-RI MSDC-RI MSDC-RI MSDC-RI
Column type Packed
Active phase Squalane
Column length (m)
Carrier gas
Substrate
Column diameter (mm)
Phase thickness (μm)
Program not specified
I 754.4
ReferenceKeiko, Prokop'ev, et al., 1972
Comment MSDC-RI

Gas phase ion energetics data

Data compiled by: Sharon G. Lias and Joel F. Liebman

Appearance energy determinations

Ion AE (eV) Other Products MethodReferenceComment
C3H7O+10.12C3H7OEIHolmes, Lossing, et al., 1991

References

Zenkevich, 1998
Zenkevich, I.G., Reciprocally Unambiguous Conformity Between GC Retention Indices and Boiling Points within Two- and Multidimensional Taxonomic Groups of Organic Compounds, J. Hi. Res. Chromatogr., 1998, 21, 10, 565-568, https://doi.org/10.1002/(SICI)1521-4168(19981001)21:10<565::AID-JHRC565>3.0.CO;2-6 . [all data]

Zenkevich, 1997
Zenkevich, I.G., Influence of the Variations of Dynamics Molecular Parameterts on the Additivity of Chromatigraphic Retention Indices of Products of Organic Reactions Relative to Initial Reagents, Dokl. Akad. Nauk (Rus.), 1997, 353, 5, 625-627. [all data]

Kawai, Ishida, et al., 1991
Kawai, T.; Ishida, Y.; Kakiuchi, H.; Ikeda, N.; Higashida, T.; Nakamura, S., Flavor components of dried squid, J. Agric. Food Chem., 1991, 39, 4, 770-777, https://doi.org/10.1021/jf00004a031 . [all data]

Keiko, Prokop'ev, et al., 1972
Keiko, V.V.; Prokop'ev, B.V.; Kuz'menko, L.P.; Kalinina, N.A.; Modonov, V.B., The use of an additive scheme of calculation of the indices of retention in gas-liquid chromatography communication. 3. Some regularities in the manifestation of the inductive effect, Izv. Akad. Nauk Kaz. SSR Ser. Khim., 1972, 12, 2629-2633. [all data]