Heptanonitrile

Van Den Dool and Kratz RI, polar column, custom temperature program

Data compiled by: NIST Mass Spectrometry Data Center, William E. Wallace, director

Column type Capillary
Active phase CP-Wax 52CB
Column length (m) 60.
Carrier gas He
Substrate
Column diameter (mm) 0.25
Phase thickness (μm) 0.25
Program 45C(5min) => 10C/min => 80C => 2C/min => 240C
I 1405.
ReferenceCondurso, Verzera, et al., 2006
Comment MSDC-RI

Gas phase thermochemistry data

Data compiled by: Hussein Y. Afeefy, Joel F. Liebman, and Stephen E. Stein

Quantity Value Units Method Reference Comment
Δfgas-7.4 ± 0.3kcal/molCcbLebedeva and Katin, 1973Heat of combustion is not reported

Condensed phase thermochemistry data

Data compiled by: Hussein Y. Afeefy, Joel F. Liebman, and Stephen E. Stein

Quantity Value Units Method Reference Comment
Δfliquid-19.8 ± 0.2kcal/molCcbLebedeva and Katin, 1973Heat of combustion is not reported

Phase change data

Data compiled as indicated in comments:
TRC - Thermodynamics Research Center, NIST Boulder Laboratories, Chris Muzny director
AC - William E. Acree, Jr., James S. Chickos
ALS - Hussein Y. Afeefy, Joel F. Liebman, and Stephen E. Stein
DRB - Donald R. Burgess, Jr.

Quantity Value Units Method Reference Comment
Tboil453. ± 6.KAVGN/AAverage of 6 values; Individual data points
Quantity Value Units Method Reference Comment
Tfus209.35KN/ATimmermans, 1952Uncertainty assigned by TRC = 0.5 K; TRC
Tfus210.55KN/AMerckx, Verhulst, et al., 1933Uncertainty assigned by TRC = 2. K; TRC
Tfus209.15KN/ATimmermans and Mattaar, 1921Uncertainty assigned by TRC = 0.5 K; TRC
Quantity Value Units Method Reference Comment
Δvap12.3 ± 0.5kcal/molAVGN/AAverage of 6 values; Individual data points

Enthalpy of vaporization

ΔvapH (kcal/mol) Temperature (K) Method Reference Comment
11.0328.AStephenson and Malanowski, 1987Based on data from 313. - 473. K.; AC
11.1309.N/AStull, 1947Based on data from 294. - 457. K.; AC

In addition to the Thermodynamics Research Center (TRC) data available from this site, much more physical and chemical property data is available from the following TRC products:

Gas phase ion energetics data

Data compiled by: Michael M. Meot-Ner (Mautner)

Proton affinity at 298K

Proton affinity (kcal/mol) Reference
192.5Cao and Holmes, 1999
193.Cao and Holmes, 1999

Van Den Dool and Kratz RI, non-polar column, temperature ramp

View large format table.

Column type Active phase I Reference Comment
CapillaryMega 5MS990.Condurso, Verzera, et al., 200660. m/0.25 mm/0.25 μm, He, 3. K/min; Tstart: 60. C; Tend: 240. C

Normal alkane RI, non-polar column, temperature ramp

View large format table.

Column type Active phase I Reference Comment
CapillaryHP-1949.Valette, Fernandez, et al., 200650. m/0.2 mm/0.5 μm, He, 2. K/min, 250. C @ 40. min; Tstart: 60. C
CapillaryHP-1945.Bendimerad and Bendiab, 200550. m/0.2 mm/0.5 μm, He, 2. K/min, 250. C @ 60. min; Tstart: 60. C
CapillaryOV-101961.Zenkevich, 200525. m/0.20 mm/0.10 μm, N2/He, 6. K/min; Tstart: 50. C; Tend: 250. C
CapillaryDB-5985.Macku and Shibamoto, 1991He, 40. C @ 5. min, 2. K/min; Column length: 60. m; Column diameter: 0.25 mm; Tend: 160. C

Normal alkane RI, polar column, temperature ramp

View large format table.

Column type Active phase I Reference Comment
CapillaryInnowax1396.Bendimerad and Bendiab, 200550. m/0.2 mm/0.5 μm, He, 2. K/min, 250. C @ 60. min; Tstart: 60. C
CapillaryCP-Wax 52CB1354.Rohloff and Bones, 200530. m/0.32 mm/0.25 μm, He, 40. C @ 1. min, 4. K/min; Tend: 220. C

References

Condurso, Verzera, et al., 2006
Condurso, C.; Verzera, A.; Romeo, V.; Ziino, M.; Trozzi, A.; Ragusa, S., The leaf volatile constituents of Isatis tinctoria by solid-phase microextraction and gas chromatography/mass spectrometry, Planta Medica, 2006, 72, 10, 924-928, https://doi.org/10.1055/s-2006-946679 . [all data]