Thiocyanic acid, butyl ester

Gas phase ion energetics data

Data compiled by: Sharon G. Lias, Rhoda D. Levin, and Sherif A. Kafafi

Ionization energy determinations

IE (eV) Method Reference Comment
9.64 ± 0.05PENeijzen and DeLange, 1980Vertical value

References

Neijzen and DeLange, 1980
Neijzen, B.J.M.; DeLange, C.A., Photoelectron spectroscopy of some thiocyanates, isocyanates and isothiocyanates, J. Electron Spectrosc. Relat. Phenom., 1980, 18, 179. [all data]