Isobutyl ether

Phase change data

Data compiled as indicated in comments:
BS - Robert L. Brown and Stephen E. Stein
TRC - Thermodynamics Research Center, NIST Boulder Laboratories, Chris Muzny director
AC - William E. Acree, Jr., James S. Chickos

Quantity Value Units Method Reference Comment
Tboil395.7KN/AAldrich Chemical Company Inc., 1990BS
Tboil396.2KN/AMajer and Svoboda, 1985
Tboil395.5KN/ALecat, 1947Uncertainty assigned by TRC = 0.5 K; TRC
Quantity Value Units Method Reference Comment
Δvap40.85kJ/molN/AMajer and Svoboda, 1985
Δvap41.2 ± 0.7kJ/molEBEfimova, Druzhinina, et al., 2009Based on data from 331. - 395. K.; AC

Enthalpy of vaporization

ΔvapH (kJ/mol) Temperature (K) Method Reference Comment
33.95396.2N/AMajer and Svoboda, 1985
38.9335.AStephenson and Malanowski, 1987Based on data from 320. - 396. K.; AC

Enthalpy of fusion

ΔfusH (kJ/mol) Temperature (K) Method Reference Comment
11.33190.4ACEfimova, Druzhinina, et al., 2009Based on data from 8. - 383. K.; AC

In addition to the Thermodynamics Research Center (TRC) data available from this site, much more physical and chemical property data is available from the following TRC products:

Normal alkane RI, non-polar column, temperature ramp

View large format table.

Column type Active phase I Reference Comment
CapillaryDB-5808.Savel'eva, Zenkevich, et al., 200325. m/0.20 mm/0.33 μm, Helium, 40. C @ 1. min, 5. K/min, 270. C @ 15. min

Normal alkane RI, non-polar column, custom temperature program

View large format table.

Column type Active phase I Reference Comment
CapillaryOV-1811.Ramsey and Flanagan, 1982Program: not specified

Normal alkane RI, polar column, custom temperature program

View large format table.

Column type Active phase I Reference Comment
CapillaryCarbowax 20M969.Ramsey and Flanagan, 1982Program: not specified

References

Aldrich Chemical Company Inc., 1990
Aldrich Chemical Company Inc., Catalog Handbook of Fine Chemicals, Aldrich Chemical Company, Inc., Milwaukee WI, 1990, 1. [all data]

Majer and Svoboda, 1985
Majer, V.; Svoboda, V., Enthalpies of Vaporization of Organic Compounds: A Critical Review and Data Compilation, Blackwell Scientific Publications, Oxford, 1985, 300. [all data]

Lecat, 1947
Lecat, M., Orthobaric Azeotropes of Sulfides, Bull. Cl. Sci., Acad. R. Belg., 1947, 33, 160-82. [all data]

Efimova, Druzhinina, et al., 2009
Efimova, Anastasia A.; Druzhinina, Anna I.; Varushchenko, Raisa M.; Dorofeeva, Olga V.; Krasnyh, Eugenii L., Phase Equilibria and Thermodynamic Properties of Some Branched Alkyl Ethers «8224», J. Chem. Eng. Data, 2009, 54, 9, 2457-2469, https://doi.org/10.1021/je800998u . [all data]

Stephenson and Malanowski, 1987
Stephenson, Richard M.; Malanowski, Stanislaw, Handbook of the Thermodynamics of Organic Compounds, 1987, https://doi.org/10.1007/978-94-009-3173-2 . [all data]