Hexane, 3,4-bis(1,1-dimethylethyl)-2,2,5,5-tetramethyl-

Gas phase thermochemistry data

Data compiled by: Hussein Y. Afeefy, Joel F. Liebman, and Stephen E. Stein

Quantity Value Units Method Reference Comment
Δfgas-251. ± 4.kJ/molCcrFlamm-ter Meer, Beckhaus, et al., 1984

Condensed phase thermochemistry data

Data compiled by: Hussein Y. Afeefy, Joel F. Liebman, and Stephen E. Stein

Quantity Value Units Method Reference Comment
Δfsolid-325. ± 4.kJ/molCcrFlamm-ter Meer, Beckhaus, et al., 1984
Quantity Value Units Method Reference Comment
Δcsolid-12189. ± 4.kJ/molCcrFlamm-ter Meer, Beckhaus, et al., 1984Corresponding Δfsolid = -325. kJ/mol (simple calculation by NIST; no Washburn corrections)

Phase change data

Data compiled as indicated in comments:
DRB - Donald R. Burgess, Jr.
AC - William E. Acree, Jr., James S. Chickos
ALS - Hussein Y. Afeefy, Joel F. Liebman, and Stephen E. Stein

Quantity Value Units Method Reference Comment
Δsub74.0kJ/molN/AFlamm-ter Meer, Beckhaus, et al., 1984DRB
Δsub74.3kJ/molN/AMeer, Beckhaus, et al., 1984AC

Enthalpy of sublimation

ΔsubH (kJ/mol) Temperature (K) Method Reference Comment
74.27 ± 0.54303.VFlamm-ter Meer, Beckhaus, et al., 1984ALS
71.9341.N/AMeer, Beckhaus, et al., 1984Based on data from 303. - 366. K.; AC

References

Flamm-ter Meer, Beckhaus, et al., 1984
Flamm-ter Meer, M.A.; Beckhaus, H.D.; Ruchardt, C., Thermolabile kohlenwasserstoffe XXVI. Bildungsenthalpie von 1,1,2,2-tetra-tert-butylethan, Thermochim. Acta, 1984, 80, 81-89. [all data]

Meer, Beckhaus, et al., 1984
Meer, M.A. Flamm-Ter; Beckhaus, H.D.; Rüchardt, C., Thermolabile kohlenwasserstoffe. XXVI. Bildungsenthalpie von 1,1,2,2-tetra-tert-butylethan, Thermochimica Acta, 1984, 80, 1, 81-89, https://doi.org/10.1016/0040-6031(84)87185-3 . [all data]