Formamide, N-propyl-

Gas phase ion energetics data

Data evaluated by: Edward P. Hunter and Sharon G. Lias

Quantity Value Units Method Reference Comment
Proton affinity (review)878.4kJ/molN/AHunter and Lias, 1998
Quantity Value Units Method Reference Comment
Gas basicity847.4kJ/molN/AHunter and Lias, 1998

Kovats' RI, non-polar column, isothermal

View large format table.

Column type Active phase Temperature (C) I Reference Comment
PackedSE-30180.934.Krawczyk and Piotrowski, 1989N2, Chromosorb W AW; Column length: 1. m

References

Hunter and Lias, 1998
Hunter, E.P.; Lias, S.G., Evaluated Gas Phase Basicities and Proton Affinities of Molecules: An Update, J. Phys. Chem. Ref. Data, 1998, 27, 3, 413-656, https://doi.org/10.1063/1.556018 . [all data]

Krawczyk and Piotrowski, 1989
Krawczyk, W.; Piotrowski, G.T., Relationships Between Structure and Retention Index for N-Substituted Amides of Aliphatic Acids on a Non-Polar Column, J. Chromatogr., 1989, 463, 297-304, https://doi.org/10.1016/S0021-9673(01)84484-8 . [all data]