1-Propanol, 3-chloro-, acetate

Phase change data

Data compiled by: Robert L. Brown and Stephen E. Stein

Reduced pressure boiling point

Tboil (K) Pressure (bar) Reference
353.70.040Aldrich Chemical Company Inc., 1990

Kovats' RI, non-polar column, isothermal

View large format table.

Column type Active phase Temperature (C) I Reference Comment
CapillarySE-30100.902.Tarjan, Nyiredy, et al., 1989
CapillarySE-3080.916.Tarjan, Nyiredy, et al., 1989
CapillarySE-30100.902.Haken and Korhonen, 1986N2; Column length: 25. m; Column diameter: 0.33 mm
CapillarySE-30120.895.Haken and Korhonen, 1986N2; Column length: 25. m; Column diameter: 0.33 mm
CapillarySE-3060.924.Haken and Korhonen, 1986N2; Column length: 25. m; Column diameter: 0.33 mm
CapillarySE-3080.916.Haken and Korhonen, 1986N2; Column length: 25. m; Column diameter: 0.33 mm
CapillaryOV-10180.922.Komárek, Hornová, et al., 1983Column length: 15. m; Column diameter: 0.22 mm

Kovats' RI, polar column, isothermal

View large format table.

Column type Active phase Temperature (C) I Reference Comment
CapillaryOV-351100.1414.Haken and Korhonen, 1986N2; Column length: 25. m; Column diameter: 0.32 mm
CapillaryOV-351120.1419.Haken and Korhonen, 1986N2; Column length: 25. m; Column diameter: 0.32 mm
CapillaryOV-35160.1418.Haken and Korhonen, 1986N2; Column length: 25. m; Column diameter: 0.32 mm
CapillaryOV-35180.1425.Haken and Korhonen, 1986N2; Column length: 25. m; Column diameter: 0.32 mm

References

Aldrich Chemical Company Inc., 1990
Aldrich Chemical Company Inc., Catalog Handbook of Fine Chemicals, Aldrich Chemical Company, Inc., Milwaukee WI, 1990, 1. [all data]

Tarjan, Nyiredy, et al., 1989
Tarjan, G.; Nyiredy, Sz.; Gyor, M.; Lombosi, E.R.; Lombosi, T.S.; Budahegyi, M.V.; Meszaros, S.Y.; Takacs, J.M., Review. Thirtieth Anniversary of the Retention Index According to Kovats in Gas-Liquid Chromatography, J. Chromatogr., 1989, 472, 1-92, https://doi.org/10.1016/S0021-9673(00)94099-8 . [all data]

Haken and Korhonen, 1986
Haken, J.K.; Korhonen, I.O.O., Gas chromatography of homologous esters. XXXII. Capillary chromatography of C1-C18 monochlorinated n-alkyl acetates, J. Chromatogr., 1986, 356, 79-94, https://doi.org/10.1016/S0021-9673(00)91468-7 . [all data]

Komárek, Hornová, et al., 1983
Komárek, K.; Hornová, L.; Horna, A.; Churácek, J., Glass capillary gas chromatography of homologous series of esters. IV. Separation of homologous series of certain halogenopropyl esters of aliphatic carboxylic acids on OV-101, J. Chromatogr., 1983, 281, 299-303, https://doi.org/10.1016/S0021-9673(01)87889-4 . [all data]