Pentane, 1-nitro-

Normal alkane RI, non-polar column, temperature ramp

Data compiled by: NIST Mass Spectrometry Data Center, William E. Wallace, director

Column type Capillary
Active phase OV-101
Column length (m) 25.
Carrier gas N2/He
Substrate
Column diameter (mm) 0.20
Phase thickness (μm) 0.10
Tstart (C) 50.
Tend (C) 250.
Heat rate (K/min) 6.
Initial hold (min)
Final hold (min)
I 902.
ReferenceZenkevich, 2005
Comment MSDC-RI

Condensed phase thermochemistry data

Data compiled by: Hussein Y. Afeefy, Joel F. Liebman, and Stephen E. Stein

Quantity Value Units Method Reference Comment
Δfliquid-215. ± 1.5kJ/molCcbLebedeva and Ryadenko, 1973
Quantity Value Units Method Reference Comment
Δcliquid-3324. ± 1.5kJ/molCcbLebedeva and Ryadenko, 1973

References

Zenkevich, 2005
Zenkevich, I.G., Experimentally measured retention indices., 2005. [all data]