Bis(9-azabicyclo[3.3.1]non-9-yl-)

Gas phase ion energetics data

Data compiled as indicated in comments:
LBLHLM - Sharon G. Lias, John E. Bartmess, Joel F. Liebman, John L. Holmes, Rhoda D. Levin, and W. Gary Mallard
LLK - Sharon G. Lias, Rhoda D. Levin, and Sherif A. Kafafi

Ionization energy determinations

IE (eV) Method Reference Comment
8.01PENelsen, 1984Vertical value; LBLHLM
6.94PENelsen and Gannett, 1982Vertical value; LBLHLM
6.94PENelsen, Kessel, et al., 1980Vertical value; LLK

References

Nelsen, 1984
Nelsen, S.F., Ionization from nitrogen and oxygen lone pairs: A comparison of trialkylamine, dialkyl ether, tetraalkylhydrazine, and dialkyl peroxide photoelectron spectroscopic ionization potentials, J. Org. Chem., 1984, 49, 1891. [all data]

Nelsen and Gannett, 1982
Nelsen, S.F.; Gannett, P.M., The 3,3-dimethyl-2-azabicyclo[2.2.2]octyl system as a Bredt's rule kinetically stabilized dialkylamino group in electron transfer studies, J. Am. Chem. Soc., 1982, 104, 5292. [all data]

Nelsen, Kessel, et al., 1980
Nelsen, S.F.; Kessel, C.R.; Brien, D.J., Bredt's rule kinetically stabilized nitrogen-centered and radical cations radicals in the 9-azabicyclo[3.3.1]nonyl system, J. Am. Chem. Soc., 1980, 102, 702. [all data]