1,1'-Biphenyl, 2,2',4,6-Tetrachloro-

Normal alkane RI, non-polar column, isothermal

View large format table.

Column type Active phase Temperature (C) I Reference Comment
CapillaryApiezon L180.1873.Ballschmiter and Zell, 1980H2; Column length: 40. m; Column diameter: 0.30 mm

Normal alkane RI, non-polar column, custom temperature program

View large format table.

Column type Active phase I Reference Comment
CapillaryApolane1831.Bush, Murphy, et al., 1985He; Column length: 50. m; Column diameter: 0.25 mm; Program: 70 0C (2 min) 10 0C/min (6 min) 2 0C/min -> 250 0C
CapillaryApolane1835.Bush, Murphy, et al., 1985He; Column length: 50. m; Column diameter: 0.25 mm; Program: 70 0C (2 min) 10 0C/min (6 min) 2 0C/min -> 250 0C
CapillaryApiezon L1872.Ballschmiter and Zell, 1980H2; Column length: 40. m; Column diameter: 0.30 mm; Program: not specified

References

Ballschmiter and Zell, 1980
Ballschmiter, K.; Zell, M., Analysis of polychlorinated biphenyls (PCB) by glass capillary gas chromatography, Fresenius Z. Anal. Chem., 1980, 302, 1, 20-31, https://doi.org/10.1007/BF00469758 . [all data]

Bush, Murphy, et al., 1985
Bush, B.; Murphy, M.J.; Connor, S.; Snow, J.; Barnard, E., Improvements in Glass Capillary Gas Chromatographic Polychlorobiphenyl Analysis, J. Chromatogr. Sci., 1985, 23, 11, 509-515, https://doi.org/10.1093/chromsci/23.11.509 . [all data]