Hexanedioic acid, dimethyl ester

Normal alkane RI, non-polar column, custom temperature program

Data compiled by: NIST Mass Spectrometry Data Center, William E. Wallace, director

Column type CapillaryCapillaryOther
Active phase SE-30OV-1, SE-30, Methyl silicone, SP-2100, OV-101, DB-1, etc.Methyl Silicone
Column length (m)  50.
Carrier gas  Hydrogen
Substrate
Column diameter (mm)  0.32
Phase thickness (μm)
Program not specifiednot specifiednot specified
I 1212.1223.1213.
ReferenceVinogradov, 2004Waggott and Davies, 1984Ardrey and Moffat, 1981
Comment MSDC-RI MSDC-RI MSDC-RI

Condensed phase thermochemistry data

Data compiled by: Hussein Y. Afeefy, Joel F. Liebman, and Stephen E. Stein

Quantity Value Units Method Reference Comment
Δfliquid-206.22 ± 0.76kcal/molCcbContineanu, Corlateanu, et al., 1981
Quantity Value Units Method Reference Comment
Δcliquid-1024.43 ± 0.76kcal/molCcbContineanu, Corlateanu, et al., 1981Corresponding Δfliquid = -206.18 kcal/mol (simple calculation by NIST; no Washburn corrections)
Quantity Value Units Method Reference Comment
Δcsolid-1019.6kcal/molCcbVerkade, Coops, et al., 1926Heat of combustion at 15°C; Corresponding Δfsolid = -211.0 kcal/mol (simple calculation by NIST; no Washburn corrections)

Phase change data

Data compiled as indicated in comments:
TRC - Thermodynamics Research Center, NIST Boulder Laboratories, Chris Muzny director
BS - Robert L. Brown and Stephen E. Stein
AC - William E. Acree, Jr., James S. Chickos

Quantity Value Units Method Reference Comment
Tboil508.KN/ACorish and Davison, 1958Uncertainty assigned by TRC = 4. K; TRC
Quantity Value Units Method Reference Comment
Tfus283.5KN/APalomaa and Mikkila, 1942Uncertainty assigned by TRC = 0.6 K; TRC
Tfus283.5KN/AVerkade, Hartmann, et al., 1926Uncertainty assigned by TRC = 1. K; TRC
Quantity Value Units Method Reference Comment
Δvap16.0 ± 0.07kcal/molGSVasiltsova, Verevkin, et al., 2006Based on data from 293. - 344. K. See also Verevkin, Kozlova, et al., 2006.; AC
Δvap16.5 ± 0.05kcal/molGSVerevkin, Kozlova, et al., 2006Based on data from 294. - 373. K.; AC
Δvap17.5kcal/molN/AVlasov, Granzhan, et al., 1963Based on data from 428. - 498. K. See also Verevkin, Kozlova, et al., 2006.; AC

Reduced pressure boiling point

Tboil (K) Pressure (atm) Reference Comment
382.70.018Aldrich Chemical Company Inc., 1990BS

Enthalpy of vaporization

ΔvapH (kcal/mol) Temperature (K) Method Reference Comment
17.8368.N/ALee, Lai, et al., 2007Based on data from 353. - 443. K.; AC
14.1397.AStephenson and Malanowski, 1987Based on data from 382. - 500. K.; AC

In addition to the Thermodynamics Research Center (TRC) data available from this site, much more physical and chemical property data is available from the following TRC products:

Kovats' RI, non-polar column, isothermal

View large format table.

Column type Active phase Temperature (C) I Reference Comment
CapillarySE-54140.1243.Grigor'eva, Vasil'ev, et al., 199315. m/0.28 mm/2.4 μm, Ar
CapillarySE-54160.1242.Grigor'eva, Vasil'ev, et al., 199315. m/0.28 mm/2.4 μm, Ar
CapillarySE-54180.1241.Grigor'eva, Vasil'ev, et al., 199315. m/0.28 mm/2.4 μm, Ar
CapillaryUltra-1100.1207.Herrmann, Dufka, et al., 198625. m/0.20 mm/0.32 μm, N2
CapillaryUltra-1125.1205.Herrmann, Dufka, et al., 198625. m/0.20 mm/0.32 μm, N2
CapillaryUltra-1150.1204.Herrmann, Dufka, et al., 198625. m/0.20 mm/0.32 μm, N2
CapillaryUltra-1175.1202.Herrmann, Dufka, et al., 198625. m/0.20 mm/0.32 μm, N2
PackedSE-30220.1234.Zulaïca and Guiochon, 1963Column length: 2. m

Kovats' RI, non-polar column, custom temperature program

View large format table.

Column type Active phase I Reference Comment
PackedSE-301223.Ramsey, Lee, et al., 1980He, Chromosorb G HP (80-100 mesh); Column length: 1.5 m; Program: not specified

Kovats' RI, polar column, isothermal

View large format table.

Column type Active phase Temperature (C) I Reference Comment
CapillaryPEG-40M120.1777.Grigor'eva, Vasil'ev, et al., 199340. m/0.25 mm/0.10 μm, Ar
CapillaryPEG-40M120.1809.Grigor'eva, Vasil'ev, et al., 199340. m/0.25 mm/0.10 μm, Ar

Van Den Dool and Kratz RI, non-polar column, temperature ramp

View large format table.

Column type Active phase I Reference Comment
CapillaryDB-11208.2Sun and Stremple, 200330. m/0.25 mm/0.25 μm, He, 3. K/min; Tstart: 40. C; Tend: 325. C
CapillaryHP-51246.Flamini, Cioni, et al., 200230. m/0.25 mm/0.25 μm, N2, 60. C @ 10. min, 5. K/min; Tend: 220. C
CapillaryDB-11206.Johnson, Urso, et al., 199730. m/0.2 mm/0.25 μm, 50. C @ 2. min, 5. K/min, 300. C @ 5. min
Capillary5 % Phenyl methyl siloxane1235.Guisto, Smith, et al., 199325. m/0.31 mm/0.31 μm, 50. C @ 1. min, 5. K/min, 250. C @ 10. min
Capillary5 % Phenyl methyl siloxane1256.Guisto, Smith, et al., 199330. m/0.25 mm/0.5 μm, 50. C @ 1. min, 8. K/min, 300. C @ 10. min
CapillaryDB-51243.Rostad and Pereira, 198630. m/0.26 mm/0.25 μm, He, 50. C @ 4. min, 6. K/min, 300. C @ 20. min
PackedSE-301205.Messadi and Vergnaud, 1979N2, Chromosorb Q, 10. K/min; Tstart: 100. C; Tend: 340. C
PackedSE-301213.van den Dool and Kratz, 1963Celite; Tstart: 75. C; Tend: 228. C

Van Den Dool and Kratz RI, non-polar column, custom temperature program

View large format table.

Column type Active phase I Reference Comment
CapillaryVF-5MS1246.7Tret'yakov, 200730. m/0.25 mm/0.25 μm, He; Program: Multi-step temperature program; T(initial)=60C; T(final)=270C

Van Den Dool and Kratz RI, polar column, temperature ramp

View large format table.

Column type Active phase I Reference Comment
CapillaryZB-Wax1817.Ledauphin, Saint-Clair, et al., 200430. m/0.25 mm/0.15 μm, He, 35. C @ 5. min, 5. K/min, 220. C @ 10. min
CapillaryDB-Wax1819.Shimoda, Shigematsu, et al., 199560. m/0.25 mm/0.25 μm, 2. K/min; Tstart: 50. C; Tend: 230. C
PackedCarbowax 20M1804.van den Dool and Kratz, 1963Celite 545, 4.6 K/min; Tstart: 75. C; Tend: 228. C

Normal alkane RI, non-polar column, isothermal

View large format table.

Column type Active phase Temperature (C) I Reference Comment
CapillaryOV-101100.1213.Lipp, Krasnykh, et al., 2008Helium; Column length: 50. m; Column diameter: 0.25 mm
CapillaryOV-101110.1212.Lipp, Krasnykh, et al., 2008Helium; Column length: 50. m; Column diameter: 0.25 mm
CapillaryOV-101120.1211.Lipp, Krasnykh, et al., 2008Helium; Column length: 50. m; Column diameter: 0.25 mm
CapillaryOV-10190.1215.Lipp, Krasnykh, et al., 2008Helium; Column length: 50. m; Column diameter: 0.25 mm

Normal alkane RI, non-polar column, temperature ramp

View large format table.

Column type Active phase I Reference Comment
CapillaryUltra-11206.Okumura, 199125. m/0.32 mm/0.25 μm, He, 3. K/min; Tstart: 80. C; Tend: 260. C
CapillaryOV-1011206.Pinkston, Spiteller, et al., 1981H2, 80. C @ 7. min, 2. K/min; Column length: 30. m; Column diameter: 0.3 mm; Tend: 275. C
CapillaryOV-1011206.Spiteller and Spiteller, 1979He, 75. C @ 7. min, 2. K/min; Column length: 25. m; Tend: 280. C

Normal alkane RI, polar column, custom temperature program

View large format table.

Column type Active phase I Reference Comment
CapillaryCarbowax 20M1779.Vinogradov, 2004Program: not specified

Lee's RI, non-polar column, temperature ramp

View large format table.

Column type Active phase I Reference Comment
CapillaryDB-1211.7Johnson, Urso, et al., 199730. m/0.2 mm/0.25 μm, 50. C @ 2. min, 5. K/min, 300. C @ 5. min
CapillaryDB-5210.93Rostad and Pereira, 198630. m/0.26 mm/0.25 μm, He, 50. C @ 4. min, 6. K/min, 300. C @ 20. min

References

Vinogradov, 2004
Vinogradov, B.A., Production, composition, properties and application of essential oils, 2004, retrieved from http://viness.narod.ru. [all data]

Waggott and Davies, 1984
Waggott, A.; Davies, I.W., Identification of organic pollutants using linear temperature programmed retention indices (LTPRIs) - Part II, 1984, retrieved from http://dwi.defra.gov.uk/research/completed-research/reports/dwi0383.pdf. [all data]

Ardrey and Moffat, 1981
Ardrey, R.E.; Moffat, A.C., Gas-liquid chromatographic retention indices of 1318 substances of toxicological interest on SE-30 or OV-1 stationary phase, J. Chromatogr., 1981, 220, 3, 195-252, https://doi.org/10.1016/S0021-9673(00)81925-1 . [all data]