Sodium oxalate

Condensed phase thermochemistry data

Data compiled by: Eugene S. Domalski and Elizabeth D. Hearing

Constant pressure heat capacity of solid

Cp,solid (cal/mol*K) Temperature (K) Reference Comment
31.1281.Cherbov and Chernyak, 1937T = 273 to 373 K. Mean values, three temperatures.

References

Cherbov and Chernyak, 1937
Cherbov, S.I.; Chernyak, E.L., Measurement of the specific heat of powdered aluminum oxide and sodium oxalate, Zh. Prikl. Khim, 1937, 10, 1220-1222. [all data]