Ethyl furfuryl ether

Normal alkane RI, polar column, custom temperature program

Data compiled by: NIST Mass Spectrometry Data Center, William E. Wallace, director

Column type CapillaryCapillary
Active phase DB-WaxDB-Wax
Column length (m) 30.30.
Carrier gas  Helium
Substrate
Column diameter (mm) 0.320.32
Phase thickness (μm) 0.500.25
Program 40 0C (5 min) 4 0C/min -> 100 0C 6 0C/min -> 220 0C (40 min)50 0C 20 0C/min -> 80 0C 3 0C/min -> 230 0C
I 1291.1272.
ReferenceFerreira, Juan, et al., 2009Tao, Wenlai, et al., 2008
Comment MSDC-RI MSDC-RI

References

Ferreira, Juan, et al., 2009
Ferreira, V.; Juan, F.S.; Escudero, A.; Cullere, L.; Fernandez-Zurbano, P.; Saenz-Navajas, M.P.; Cacho, J., Modeling quality of premium Spanish red wines from gas chromatography-olfactometry data, J. Agr. Food. Chem., 2009, 57, 16, 7490-7498, https://doi.org/10.1021/jf9006483 . [all data]

Tao, Wenlai, et al., 2008
Tao, L.; Wenlai, F.; Yan, X., Characterization of volatile and semi-volatile compounds in Chinese rica wines by headspace solid phase microextraction followed by gas chromatography - mass spectrometry, J. Inst. Brew., 2008, 114, 2, 172-179, https://doi.org/10.1002/j.2050-0416.2008.tb00323.x . [all data]