4-Nitrobenzoic acid, hexyl ester

Kovats' RI, non-polar column, isothermal

View large format table.

Column type Active phase Temperature (C) I Reference Comment
CapillarySE-30160.1900.Korhonen, 1986N2; Column length: 25. m; Column diameter: 0.33 mm
CapillarySE-30180.1907.Korhonen, 1986N2; Column length: 25. m; Column diameter: 0.33 mm
CapillarySE-30200.1917.Korhonen, 1986N2; Column length: 25. m; Column diameter: 0.33 mm
CapillarySE-30220.1930.Korhonen, 1986N2; Column length: 25. m; Column diameter: 0.33 mm
CapillarySE-30240.1939.Korhonen, 1986N2; Column length: 25. m; Column diameter: 0.33 mm

Kovats' RI, polar column, isothermal

View large format table.

Column type Active phase Temperature (C) I Reference Comment
CapillaryOV-351180.2671.Korhonen, 1986N2; Column length: 25. m; Column diameter: 0.32 mm
CapillaryOV-351200.2704.Korhonen, 1986N2; Column length: 25. m; Column diameter: 0.32 mm
CapillaryOV-351220.2719.Korhonen, 1986N2; Column length: 25. m; Column diameter: 0.32 mm

Van Den Dool and Kratz RI, non-polar column, temperature ramp

View large format table.

Column type Active phase I Reference Comment
CapillarySE-301911.Korhonen, 1986N2, 6. K/min; Column length: 25. m; Column diameter: 0.33 mm; Tstart: 100. C; Tend: 310. C

Van Den Dool and Kratz RI, polar column, temperature ramp

View large format table.

Column type Active phase I Reference Comment
CapillaryOV-3512689.Korhonen, 1986N2, 6. K/min; Column length: 25. m; Column diameter: 0.32 mm; Tstart: 100. C; Tend: 220. C

References

Korhonen, 1986
Korhonen, I.O.O., Gas-Liquid Chromatographic Analyses. XLV. Retention Behaviour of C1-C12 n-Alkyl Esters of Benzoic, 4-Nitrobenzoic and 3,5-Dinitrobenzoic Acids on SE-30 and OV-351 Capillary Columns, J. Chromatogr., 1986, 356, 285-299, https://doi.org/10.1016/S0021-9673(00)91489-4 . [all data]