2,2-Dicyanohexanenitrile

Phase change data

Data compiled by: William E. Acree, Jr., James S. Chickos

Enthalpy of vaporization

ΔvapH (kcal/mol) Temperature (K) Method Reference
14.6 ± 0.05288. - 323.GSRakus, Verevkin, et al., 1994

References

Rakus, Verevkin, et al., 1994
Rakus, K.; Verevkin, S.P.; Beckhaus, H.-D.; Rchardt, C., Thermochemistry and thermal decomposition of alkyl-substituted tricyanomethyl compounds, Chem. Ber., 1994, 127, 2225-2234. [all data]