3-Formyl-2-methylthiopyridine

Gas phase ion energetics data

Data compiled by: Sharon G. Lias, Rhoda D. Levin, and Sherif A. Kafafi

Ionization energy determinations

IE (eV) Method Reference Comment
8.2PEDreier, Becher, et al., 1981
8.55PEDreier, Becher, et al., 1981Vertical value

References

Dreier, Becher, et al., 1981
Dreier, C.; Becher, J.; Frandsen, E.G.; Henriksen, L., Pyridinethiones - V. Spectroscopic investigation and electronic structure of 3-formyl-2(1H)-pyridones,-thiones and -selones, Tetrahedron, 1981, 37, 2663. [all data]