Benzene, 1,3,5-tribromo-
- Formula: C6H3Br3
- Molecular weight: 314.800
- IUPAC Standard InChIKey: YWDUZLFWHVQCHY-UHFFFAOYSA-N
- CAS Registry Number: 626-39-1
- Chemical structure:

Gas phase ion energetics data

Data compiled by: Sharon G. Lias, Rhoda D. Levin, and Sherif A. Kafafi
Ionization energy determinations
IE (eV) | Method | Reference | Comment |
---|---|---|---|
9.1 | PE | Kimura, Katsumata, et al., 1981 | |
9.21 ± 0.02 | PE | Mohraz, Maier, et al., 1980 | |
9.21 | PE | Kimura, Katsumata, et al., 1981 | Vertical value |
8.91 | PE | Streets and Ceasar, 1973 | Vertical value |

Phase change data

Data compiled as indicated in comments:
BS - Robert L. Brown and Stephen E. Stein
AC - William E. Acree, Jr., James S. Chickos

Quantity Value Units Method Reference Comment
Tboil544.2KN/AAldrich Chemical Company Inc., 1990BS

Enthalpy of fusion

ΔfusH (kJ/mol) Temperature (K) Reference Comment
21.72395.van der Linde, van Miltenburg, et al., 2005AC

References

Kimura, Katsumata, et al., 1981
Kimura, K.; Katsumata, S.; Achiba, Y.; Yamazaki, T.; Iwata, S.,
Ionization energies, Ab initio assignments, and valence electronic structure for 200 molecules
in Handbook of HeI Photoelectron Spectra of Fundamental Organic Compounds, Japan Scientific Soc. Press, Tokyo, 1981. [all data]
Mohraz, Maier, et al., 1980
Mohraz, M.; Maier, J.P.; Heilbronner, E.,
He(I α) and He(Iα) photoelectron spectra of fluorinated chloro- and bromobenzenes,
J. Electron Spectrosc. Relat. Phenom., 1980, 19, 429. [all data]
Streets and Ceasar, 1973
Streets, D.G.; Ceasar, G.P.,
Inductive mesomeric effects on the π orbitals of halobenzenes,
Mol. Phys., 1973, 26, 1037. [all data]