Cedran-diol, (8S,14)-

Van Den Dool and Kratz RI, non-polar column, temperature ramp

View large format table.

Column type Active phase I Reference Comment
CapillaryDB-51876.Sati and Mathela, 200530. m/0.25 mm/0.26 μm, He, 3. K/min; Tstart: 60. C; Tend: 210. C

References

Sati and Mathela, 2005
Sati, S.; Mathela, C.S., Essential oil composition of Valeriana hardwickii var. arnottiana from the Himalayas, Flavour Fragr. J., 2005, 20, 3, 299-301, https://doi.org/10.1002/ffj.1415 . [all data]