n-Hexyl salicylate

Kovats' RI, non-polar column, isothermal

Data compiled by: NIST Mass Spectrometry Data Center, William E. Wallace, director

Column type CapillaryCapillary
Active phase SE-30SE-30
Column length (m)  40.
Carrier gas
Substrate
Column diameter (mm)  0.35
Phase thickness (μm)  0.35
Temperature (C) 150.100.
I 1652.1651.5
ReferenceTudor and Moldovan, 1999Tudor, 1997
Comment MSDC-RI MSDC-RI

Normal alkane RI, polar column, temperature ramp

Data compiled by: NIST Mass Spectrometry Data Center, William E. Wallace, director

Column type Capillary
Active phase DB-Wax
Column length (m) 60.
Carrier gas He
Substrate
Column diameter (mm) 0.32
Phase thickness (μm) 0.25
Tstart (C) 60.
Tend (C) 220.
Heat rate (K/min) 3.
Initial hold (min)
Final hold (min)
I 2206.
ReferenceWerkhoff and Güntert, 1997
Comment MSDC-RI

Normal alkane RI, non-polar column, custom temperature program

Data compiled by: NIST Mass Spectrometry Data Center, William E. Wallace, director

Column type Capillary
Active phase SE-30
Column length (m)
Carrier gas
Substrate
Column diameter (mm)
Phase thickness (μm)
Program not specified
I 1664.
ReferenceVinogradov, 2004
Comment MSDC-RI

References

Tudor and Moldovan, 1999
Tudor, E.; Moldovan, D., Temperature Dependence of the Retention Index for Perfumery Compounds on a Se-30 Glass Capillary Column. II. The Hyperbolic Equation, J. Chromatogr., 1999, 848, 1-2, 215-227, https://doi.org/10.1016/S0021-9673(99)00412-4 . [all data]

Tudor, 1997
Tudor, E., Temperature dependence of the retention index for perfumery compounds on a SE-30 glass capillary column. I. Linear equations, J. Chromatogr. A, 1997, 779, 1-2, 287-297, https://doi.org/10.1016/S0021-9673(97)00453-6 . [all data]